4-(1-methylethyl)cyclohexene
- Formula: C9H16
- Molecular weight: 124.2233
- IUPAC Standard InChIKey: DUFSFEODQNDOBE-UHFFFAOYSA-N
- CAS Registry Number: 14072-82-3
- Chemical structure:
View 3d structure (requires JavaScript / HTML 5) - Species with the same structure:

Phase change data

Data compiled by: Thermodynamics Research Center, NIST Boulder Laboratories, Chris Muzny director
Quantity | Value | Units | Method | Reference | Comment |
---|---|---|---|---|---|
Tboil | 427. | K | N/A | Stork and White, 1956 | Uncertainty assigned by TRC = 3. K |

References

Stork and White, 1956
Stork, G.; White, W.N.,
The Stereochemistry of the SN2' Reaction II.,
J. Am. Chem. Soc., 1956, 78, 4609. [all data]