2-Pyrazoline, 1,3,4-trimethyl-
- Formula: C6H12N2
- Molecular weight: 112.1729
- IUPAC Standard InChIKey: UWCOGVAFZZBWAT-UHFFFAOYSA-N
- CAS Registry Number: 14044-41-8
- Chemical structure:
View 3d structure (requires JavaScript / HTML 5) - Other names: 1,3,4-Trimethyl-Δ[2]-pyrazoline; 1,3,4-Trimethyl-2-pyrazoline; 2-Pyrazoline, 2,3,4-trimethyl

Normal alkane RI, non-polar column, temperature ramp

Column type | Active phase | I | Reference | Comment |
---|---|---|---|---|
Capillary | OV-101 | 857. | Zenkevich, 2005 | 25. m/0.20 mm/0.10 μm, N2/He, 6. K/min; Tstart: 50. C; Tend: 250. C |
Capillary | OV-101 | 932. | Zenkevich, 2005 | 25. m/0.20 mm/0.10 μm, N2/He, 6. K/min; Tstart: 50. C; Tend: 250. C |

References

Zenkevich, 2005
Zenkevich, I.G.,
Experimentally measured retention indices., 2005. [all data]