C8H16OS2

Reaction thermochemistry data

Data compiled by: John E. Bartmess

Individual Reactions

C8H15OS2- + Hydrogen cation = C8H16OS2

By formula: C8H15OS2- + H+ = C8H16OS2

Quantity Value Units Method Reference Comment
Δr1513. ± 5.4kJ/molG+TSAdeuya, Artau, et al., 2004gas phase
Quantity Value Units Method Reference Comment
Δr1485. ± 5.0kJ/molCIDCAdeuya, Artau, et al., 2004gas phase

References

Adeuya, Artau, et al., 2004
Adeuya, A.; Artau, A.; Kenttamaa, H.I.; Squires, R.R., Gas-phase acidities of cis- and trans-2-tert-butyl-1,3-dithian-5-ol, J. Phys. Chem. A, 2004, 108, 36, 7379-7385, https://doi.org/10.1021/jp048812v . [all data]