Propanedioic acid, propyl-, dimethyl ester
- Formula: C8H14O4
- Molecular weight: 174.1944
- IUPAC Standard InChIKey: GQTSAGKZHIWKMR-UHFFFAOYSA-N
- CAS Registry Number: 14035-96-2
- Chemical structure:
View 3d structure (requires JavaScript / HTML 5) - Other names: Malonic acid, propyl-, dimethyl ester; Propanedioic acid, 2-propyl-, 1,3-dimethyl ester; dimethyl propylmalonate

Phase change data

Data compiled by: Thermodynamics Research Center, NIST Boulder Laboratories, Chris Muzny director
Quantity | Value | Units | Method | Reference | Comment |
---|---|---|---|---|---|
Tboil | 476.9 | K | N/A | Vogel, 1948 | Uncertainty assigned by TRC = 3. K |

References

Vogel, 1948
Vogel, A.I.,
J. Chem. Soc., 1948, 1948, 624-44. [all data]