bis(pentane-2,4-dionato-O,O')chromium

Phase change data

Data compiled by: William E. Acree, Jr., James S. Chickos

Quantity Value Units Method Reference Comment
Δsub129.8 ± 8.7kJ/molMEMalkerova, Alikhanyan, et al., 1990Based on data from 330. - 370. K.

Enthalpy of sublimation

ΔsubH (kJ/mol) Temperature (K) Method Reference
111.439.TMaslowska and Baranowski, 1981

References

Malkerova, Alikhanyan, et al., 1990
Malkerova, I.P.; Alikhanyan, A.S.; Sevast'yanov, V.G.; Grinberg, Ya.Kh.; Gorgoraki, V.I., Thermal behavior of 3d transition metal acetylacetonates, Zh. Neorg. Khim., 1990, 35, 2, 413. [all data]

Maslowska and Baranowski, 1981
Maslowska, J.; Baranowski, J.B., Chemia Analityczna, 1981, 26, 1017. [all data]