Acetic acid, phenylmethyl ester
- Formula: C9H10O2
- Molecular weight: 150.1745
- IUPAC Standard InChIKey: QUKGYYKBILRGFE-UHFFFAOYSA-N
- CAS Registry Number: 140-11-4
- Chemical structure:
View 3d structure (requires JavaScript / HTML 5) - Other names: Acetic acid, benzyl ester; α-Acetoxytoluene; Benzyl acetate; Benzyl ethanoate; NCI-C06508; Benzylester kyseliny octove; Phenylmethyl acetate; Benzyl ester of acetic acid; (Acetoxymethyl)benzene; Plastolin I; NSC 4550

Condensed phase thermochemistry data

Data compiled by: Eugene S. Domalski and Elizabeth D. Hearing
Constant pressure heat capacity of liquid
Cp,liquid (J/mol*K) | Temperature (K) | Reference |
---|---|---|
148.5 | 298.15 | Fuchs, 1979 |
154.0 | 306.0 | Phillip, 1939 |
250.2 | 292.7 | Kolosovskii and Udovenko, 1934 |
250.2 | 292.7 | de Kolossowsky and Udowenko, 1933 |

Phase change data

Data compiled as indicated in comments:
BS - Robert L. Brown and Stephen E. Stein
TRC - Thermodynamics Research Center, NIST Boulder Laboratories, Chris Muzny director
AC - William E. Acree, Jr., James S. Chickos
Quantity | Value | Units | Method | Reference | Comment |
---|---|---|---|---|---|
Tboil | 479.2 | K | N/A | Aldrich Chemical Company Inc., 1990 | BS |
Tboil | 487. | K | N/A | American Tokyo Kasei, 1988 | BS |
Tboil | 487.15 | K | N/A | Katti and Chaudhri, 1964 | Uncertainty assigned by TRC = 0.5 K; TRC |
Tboil | 488.1 | K | N/A | Lecat, 1927 | Uncertainty assigned by TRC = 0.5 K; TRC |
Tboil | 488.1 | K | N/A | Lecat, 1926 | Uncertainty assigned by TRC = 0.5 K; TRC |
Quantity | Value | Units | Method | Reference | Comment |
Tfus | 221.65 | K | N/A | Timmermans, 1921 | Uncertainty assigned by TRC = 0.3 K; TRC |
Quantity | Value | Units | Method | Reference | Comment |
ΔvapH° | 55.5 | kJ/mol | A | Stephenson and Malanowski, 1987 | Based on data from 283. to 490. K.; AC |
Reduced pressure boiling point
Tboil (K) | Pressure (bar) | Reference | Comment |
---|---|---|---|
407. | 0.136 | Buckingham and Donaghy, 1982 | BS |
Enthalpy of vaporization
ΔvapH (kJ/mol) | Temperature (K) | Method | Reference | Comment |
---|---|---|---|---|
60.4 | 305. | ME | Serpinskii, Voitkevich, et al., 1954 | Based on data from 283. to 328. K.; AC |
Antoine Equation Parameters
log10(P) = A − (B / (T + C))
P = vapor pressure (bar)
T = temperature (K)
View plot Requires a JavaScript / HTML 5 canvas capable browser.
Temperature (K) | A | B | C | Reference | Comment |
---|---|---|---|---|---|
319. to 429. | 2.34301 | 791.918 | -175.864 | Gardner and Brewer, 1937 | Coefficents calculated by NIST from author's data. |

Gas phase ion energetics data

Data compiled by: John E. Bartmess
Electron affinity determinations
EA (eV) | Method | Reference | Comment |
---|---|---|---|
0.15 ± 0.10 | ECD | Zlatkis, Lee, et al., 1983 |

Ion clustering data

Data compiled by: Michael M. Meot-Ner (Mautner) and Sharon G. Lias
Clustering reactions
By formula: C3H3+ + C9H10O2 = (C3H3+ • C9H10O2)
Quantity | Value | Units | Method | Reference | Comment |
---|---|---|---|---|---|
ΔrH° | 42. | kJ/mol | HPMS | Field, 1969 | gas phase; Entropy change is questionable |
Quantity | Value | Units | Method | Reference | Comment |
ΔrS° | -30. | J/mol*K | HPMS | Field, 1969 | gas phase; Entropy change is questionable |

Reaction thermochemistry data

Data compiled by: Michael M. Meot-Ner (Mautner) and Sharon G. Lias
Individual Reactions
By formula: C3H3+ + C9H10O2 = (C3H3+ • C9H10O2)
Quantity | Value | Units | Method | Reference | Comment |
---|---|---|---|---|---|
ΔrH° | 10. | kcal/mol | HPMS | Field, 1969 | gas phase; Entropy change is questionable |
Quantity | Value | Units | Method | Reference | Comment |
ΔrS° | -7. | cal/mol*K | HPMS | Field, 1969 | gas phase; Entropy change is questionable |

Van Den Dool and Kratz RI, non-polar column, temperature ramp

Data compiled by: NIST Mass Spectrometry Data Center, William E. Wallace, director

Column type CapillaryCapillaryCapillaryCapillaryCapillary
Active phase SPB-5HP-101DB-5HP-5MSSPB-5
Column length (m) 30.25.30.30.30.
Carrier gas HeHeliumN2HeHe
Substrate
Column diameter (mm) 0.250.200.320.250.25
Phase thickness (μm) 0.250.201.0.250.25
Tstart (C) 50.70.40.60.60.
Tend (C) 220.200.230.250.250.
Heat rate (K/min) 20.3.4.4.4.
Initial hold (min) 2.2.2.2.2.
Final hold (min) 2.15.10.20.20.
I 1165.1141.1164.1165.1163.
ReferenceBalbontin, Gaete-Eastman, et al., 2007Politeo, Jukic, et al., 2007Fang and Qian, 2005Pino, Mesa, et al., 2005Pino, Marbot, et al., 2004
Comment MSDC-RI MSDC-RI MSDC-RI MSDC-RI MSDC-RI
Column type CapillaryCapillaryCapillaryCapillaryCapillary
Active phase BP-1DB-5DB-1HP-5DB-1
Column length (m) 30.30.30.30.30.
Carrier gas N2HeN2HeHe
Substrate
Column diameter (mm) 0.320.250.250.250.25
Phase thickness (μm) 0.250.250.250.250.25
Tstart (C) 60.50.50.60.40.
Tend (C) 220.290.200.280.325.
Heat rate (K/min) 5.4.5.4.3.
Initial hold (min)    5.
Final hold (min) 13. 0.
I 1149.1165.1159.1162.1128.2
ReferenceRaina, Kumar, et al., 2004Reis, Pansarim, et al., 2004Boyom, Assembe, et al., 2003Skaltsa, Demetzos, et al., 2003Sun and Stremple, 2003
Comment MSDC-RI MSDC-RI MSDC-RI MSDC-RI MSDC-RI
Column type CapillaryCapillaryCapillaryCapillaryCapillary
Active phase DB-5DB-5HP-5HP-5HP-5
Column length (m) 30.30.30.30.30.
Carrier gas HeHeN2HeHe
Substrate
Column diameter (mm) 0.250.250.250.250.25
Phase thickness (μm) 1.0.250.250.25
Tstart (C) 50.60.60.60.50.
Tend (C) 200.240.220.380.200.
Heat rate (K/min) 2.53.5.3.4.
Initial hold (min)   10. 1.
Final hold (min)
I 1168.31165.1164.1162.1164.
ReferenceXu, van Stee, et al., 2003Flamini, Cioni, et al., 2002Flamini, Cioni, et al., 2002, 2Couladis, Tsortanidou, et al., 2001Shalit, Katzir, et al., 2001
Comment MSDC-RI MSDC-RI MSDC-RI MSDC-RI MSDC-RI
Column type CapillaryCapillaryCapillaryCapillaryCapillary
Active phase HP-5SE-30DB-5DB-1DB-1
Column length (m) 50.50.30.30.60.
Carrier gas He  HeHe
Substrate
Column diameter (mm) 0.320.20.250.320.25
Phase thickness (μm) 1.05 0.255.0.25
Tstart (C) 50.50.50.35.50.
Tend (C) 290.250.250.270.250.
Heat rate (K/min) 2.6.3.10.3.5
Initial hold (min)    1.5.
Final hold (min)
I 1169.1143.1161.1147.1139.
ReferenceDavid, Scanlan, et al., 2000Paramonov, Khalilova, et al., 2000Isidorov, Zenkevich, et al., 1998Bartelt, 1997Stashenko, Prada, et al., 1996
Comment MSDC-RI MSDC-RI MSDC-RI MSDC-RI MSDC-RI
Column type CapillaryCapillaryCapillaryCapillaryCapillary
Active phase DB-5DB-1DB-1DB-1CP Sil 5 CB
Column length (m) 30.60.30.30.26.
Carrier gas HeHe
Substrate
Column diameter (mm) 0.320.250.250.250.32
Phase thickness (μm)  0.25  1.25
Tstart (C) 80.40.50.50.100.
Tend (C) 200.280.300.300.250.
Heat rate (K/min) 2.2.2.2.10.
Initial hold (min)  3.
Final hold (min) 30.10.
I 1151.1147.1129.41131.81137.
ReferenceVahirua-Lechat, Menut, et al., 1996Adedeji, Hartman, et al., 1991Chang, Sheng, et al., 1989Chang, Sheng, et al., 1989Halket and Schulten, 1985
Comment MSDC-RI MSDC-RI MSDC-RI MSDC-RI MSDC-RI
Column type CapillaryPacked
Active phase CP Sil 5 CBSE-30
Column length (m) 26.
Carrier gas
Substrate  Celite
Column diameter (mm) 0.32
Phase thickness (μm) 1.25
Tstart (C) 100.75.
Tend (C) 250.228.
Heat rate (K/min) 10.
Initial hold (min)
Final hold (min)
I 1139.1141.
ReferenceHalket and Schulten, 1985van den Dool and Kratz, 1963
Comment MSDC-RI MSDC-RI

Kovats' RI, polar column, temperature ramp

Data compiled by: NIST Mass Spectrometry Data Center, William E. Wallace, director

Column type CapillaryCapillaryCapillaryCapillaryCapillary
Active phase BP-20PE-WaxSupelcowax-10BP-20Carbowax 20M
Column length (m) 30.30.60.25.50.
Carrier gas N2N2He
Substrate
Column diameter (mm) 0.320.250.250.320.22
Phase thickness (μm) 0.25
Tstart (C) 60.60.35.70.80.
Tend (C) 220.200.200.200.200.
Heat rate (K/min) 5.5.3.4.2.
Initial hold (min)  4.5.2.
Final hold (min) 14.5.20.
I 1708.1713.1747.1771.1695.
ReferenceKhan, Verma, et al., 2006Venkateshwarlu, Chandravadana, et al., 1999Wong and Teng, 1994Wyllie and Leach, 1990Nishimura, Yamaguchi, et al., 1989
Comment MSDC-RI MSDC-RI MSDC-RI MSDC-RI MSDC-RI
Column type CapillaryCapillaryCapillaryCapillaryCapillary
Active phase Carbowax 20MCarbowax 20MCarbowax 20MCarbowax 20MCarbowax 20M
Column length (m) 50.50.50.150.70.
Carrier gas H2  HeN2
Substrate
Column diameter (mm) 0.30.230.230.640.28
Phase thickness (μm) 0.15
Tstart (C) 70.80.80.50.80.
Tend (C) 210.200.200.170.200.
Heat rate (K/min) 2.2.2.1.2.
Initial hold (min)
Final hold (min)
I 1693.1688.1689.1710.1689.
ReferenceGaydou, Randriamiharisoa, et al., 1986Toda, Mihara, et al., 1983Toda, Mihara, et al., 1983Buttery, Seifert, et al., 1982Yamaguchi and Shibamoto, 1981
Comment MSDC-RI MSDC-RI MSDC-RI MSDC-RI MSDC-RI
Column type Capillary
Active phase Carbowax 20M
Column length (m) 70.
Carrier gas N2
Substrate
Column diameter (mm) 0.28
Phase thickness (μm)
Tstart (C) 80.
Tend (C) 200.
Heat rate (K/min) 2.
Initial hold (min)
Final hold (min)
I 1690.
ReferenceYamaguchi and Shibamoto, 1981
Comment MSDC-RI

Kovats' RI, non-polar column, isothermal

View large format table.

Column type Active phase Temperature (C) I Reference Comment
CapillarySE-30120.1135.Tudor and Moldovan, 1999
CapillarySE-30100.1135.1Tudor, 199740. m/0.35 mm/0.35 μm
CapillarySE-30200.1154.Tarjan, Nyiredy, et al., 1989
PackedSE-30150.1145.Tiess, 1984Ar, Gas Chrom Q (80-100 mesh); Column length: 3. m
PackedSE-30200.1154.Haken, Hartley, et al., 1983Chromosorb W AW DMCS; Column length: 3.7 m
PackedOV-1140.1163.Tomori, Kalasz, et al., 1974N2, Gas Chrom Q; Column length: 2. m
PackedOV-1150.1168.Tomori, Kalasz, et al., 1974N2, Gas Chrom Q; Column length: 2. m
PackedOV-1160.1177.Tomori, Kalasz, et al., 1974N2, Gas Chrom Q; Column length: 2. m

Kovats' RI, non-polar column, temperature ramp

View large format table.

Column type Active phase I Reference Comment
CapillaryDB-51170.El-Massry, El-Ghorab, et al., 200230. m/0.25 mm/0.5 μm, 50. C @ 3. min, 7. K/min, 250. C @ 10. min
CapillaryOV-1011136.Gaydou, Randriamiharisoa, et al., 1986100. m/0.3 mm/0.15 μm, H2, 2. K/min; Tstart: 90. C; Tend: 220. C
CapillaryOV-1011138.Yamaguchi and Shibamoto, 1981N2, 2. K/min; Column length: 70. m; Column diameter: 0.28 mm; Tstart: 80. C; Tend: 200. C
CapillaryOV-1011138.Yamaguchi and Shibamoto, 1981N2, 2. K/min; Column length: 70. m; Column diameter: 0.28 mm; Tstart: 80. C; Tend: 200. C

Kovats' RI, non-polar column, custom temperature program

View large format table.

Column type Active phase I Reference Comment
CapillaryBP-11141.Khan, Verma, et al., 200630. m/0.32 mm/0.25 μm, N2; Program: 60C => 5C/min => 220C (5min) => 3C/min => 245C(5min)
CapillarySPB-11131.Riu-Aumatell, Castellari, et al., 200430. m/0.25 mm/0.25 μm; Program: not specified

Kovats' RI, polar column, isothermal

View large format table.

Column type Active phase Temperature (C) I Reference Comment
CapillaryCarbowax 20M150.1762.Tudor, Moldovan, et al., 1999Phase thickness: 0.45 μm

Van Den Dool and Kratz RI, non-polar column, custom temperature program

View large format table.

Column type Active phase I Reference Comment
CapillaryDB-51162.Andrade, Sampaio, et al., 200730. m/0.25 mm/0.25 μm, He; Program: 40C(2min) => 4C/min => 220C => 20C/min => 280C
CapillaryVF-5MS1160.Carasek and Pawliszyn, 200630. m/0.25 mm/0.25 μm, He; Program: 40C(2min) => 5C/min => 200C (2min) => 30C/min => 260C
CapillaryDB-51162.Sampaio and Nogueira, 200630. m/0.25 mm/0.25 μm; Program: 40C(2min) => 4C/min => 220C => 20C/min => 280C
CapillaryDB-5MS1172.Selli, Rannou, et al., 200630. m/0.32 mm/0.5 μm, He; Program: 50C => 5C/min => 200C => 8C/min => 260C(5min)
Capillary5 % Phenyl methyl siloxane1162.Sacchetti, Maietti, et al., 200530. m/0.32 mm/0.15 μm, He; Program: 45C => 1C/min => 100C => 5C/min => 250C (10min)
CapillaryDB-51164.Beaulieu and Grimm, 200130. m/0.25 mm/0.25 μm, He; Program: 50C (1min) => 5C/min => 100C => 10C/min => 250C (9min)
CapillaryHP-51163.Isidorov, Krajewska, et al., 200130. m/0.25 mm/0.25 μm, He; Program: 50C => 6C/min => 100C => 4C/min => 280C
CapillaryBPX-51184.Bauchot, Mottram, et al., 199850. m/0.32 mm/0.50 μm, He; Program: 0 0C (8 min) -> (1 min) -> 50 0C (2 min) 2.5 0C/min -> 100 0C 6 0C/min -> 250 0C
CapillaryDB-11137.Mikolajczak, Zilkowski, et al., 1984He; Column length: 15. m; Column diameter: 0.32 mm; Program: not specified
PackedOV-11160.Tomori, Kalasz, et al., 1974N2, Gas Chrom Q; Column length: 2. m; Program: not specified

Van Den Dool and Kratz RI, polar column, temperature ramp

View large format table.

Column type Active phase I Reference Comment
CapillaryHP-20M1682.Politeo, Jukic, et al., 200750. m/0.20 mm/0.20 μm, Helium, 70. C @ 4. min, 4. K/min, 180. C @ 15. min
CapillaryDB-Wax Etr1733.Aubert C. and Pitrat M., 200630. m/0.25 mm/0.25 μm, He, 40. C @ 3. min, 5. K/min, 250. C @ 15. min
CapillaryCP-Wax 52CB1741.Kourkoutas, Elmore, et al., 200660. m/0.25 mm/0.25 μm, He, 4. K/min; Tstart: 40. C; Tend: 250. C
CapillaryOV-3511696.Bonvehí, 200550. m/0.32 mm/0.2 μm, He, 5. K/min; Tstart: 60. C; Tend: 220. C
CapillaryStabilwax1739.Fang and Qian, 200530. m/0.32 mm/1. μm, N2, 40. C @ 2. min, 4. K/min, 230. C @ 10. min
CapillaryDB-Wax1754.Aubert and Bourger, 200430. m/0.25 mm/0.25 μm, H2, 40. C @ 3. min, 3. K/min, 250. C @ 20. min
CapillaryCP-Wax 52CB1733.Ferrari, Lablanquie, et al., 200430. m/0.25 mm/0.2 μm, He, 80. C @ 4. min, 10. K/min; Tend: 240. C
CapillaryZB-Wax1726.Ledauphin, Saint-Clair, et al., 200430. m/0.25 mm/0.15 μm, He, 35. C @ 5. min, 5. K/min, 220. C @ 10. min
CapillaryOV-3511696.Bonvehi and Coll, 200350. m/0.32 mm/0.2 μm, He, 5. K/min; Tstart: 60. C; Tend: 220. C
CapillaryHP-Innowax1742.Christensen, Jakobsen, et al., 1999He, 32. C @ 1. min, 2. K/min, 220. C @ 40. min; Column length: 60. m; Column diameter: 0.25 mm
CapillaryHP-Wax1767.Christensen, Jakobsen, et al., 199750. m/0.2 mm/0.4 μm, He, 30. C @ 1. min, 5. K/min, 220. C @ 30. min
CapillaryDB-Wax1742.Stashenko, Prada, et al., 199660. m/0.25 mm/0.25 μm, He, 50. C @ 5. min, 2.5 K/min; Tend: 180. C
CapillaryDB-Wax1714.Iwaoka, Hagi, et al., 1994He, 40. C @ 5. min, 2. K/min; Column length: 30. m; Column diameter: 0.25 mm; Tend: 200. C
CapillaryDB-Wax1738.Sumitani, Suekane, et al., 1994He, 40. C @ 5. min, 3. K/min; Column length: 60. m; Column diameter: 0.25 mm; Tend: 200. C
CapillaryCarbowax 20M1690.Suárez and Duque, 19912. K/min; Column length: 25. m; Column diameter: 0.31 mm; Tstart: 50. C; Tend: 200. C
CapillaryCarbowax 20M1697.Suárez and Duque, 19912. K/min; Column length: 25. m; Column diameter: 0.31 mm; Tstart: 50. C; Tend: 200. C
CapillaryDB-Wax1720.4Chang, Sheng, et al., 19892. K/min; Column length: 30. m; Column diameter: 0.25 mm; Tstart: 50. C; Tend: 240. C
CapillaryDB-Wax1722.3Chang, Sheng, et al., 19892. K/min; Column length: 30. m; Column diameter: 0.25 mm; Tstart: 50. C; Tend: 240. C
CapillaryDB-Wax1710.Fröhlich, Duque, et al., 198930. m/0.25 mm/0.25 μm, He, 50. C @ 3. min, 4. K/min; Tend: 250. C
CapillaryDB-Wax1711.Fröhlich, Duque, et al., 198930. m/0.25 mm/0.25 μm, He, 50. C @ 3. min, 4. K/min; Tend: 250. C
CapillaryCarbowax 20M1710.Chen, Kuo, et al., 1986He, 50. C @ 5. min, 2. K/min, 200. C @ 40. min; Column length: 50. m; Column diameter: 0.32 mm
CapillaryCarbowax 20M1706.Chen, Kuo, et al., 1982He, 50. C @ 10. min, 1. K/min; Tend: 160. C
PackedCarbowax 20M1728.van den Dool and Kratz, 1963Celite 545, 4.6 K/min; Tstart: 75. C; Tend: 228. C

Van Den Dool and Kratz RI, polar column, custom temperature program

View large format table.

Column type Active phase I Reference Comment
CapillaryCP-Wax 52CB1731.Romeo, Ziino, et al., 200760. m/0.25 mm/0.25 μm, He; Program: 45C(5min) => 10C/min => 80C => 2C/min => 240C
CapillaryFFAP1748.Frauendorfer and Schieberle, 200625. m/0.32 mm/0.2 μm, He; Program: 40C(1min) => 40C/min => 60C(1min) => 6C/min => 180C => 15C/min => 240C
CapillarySOLGel-Wax1691.Aubert, Baumann, et al., 200530. m/0.25 mm/0.25 μm, He; Program: 35C(5min) => 3C/min => 150C => 5C/min => 250C(10 min)
CapillarySOLGel-Wax1691.Aubert, Baumann, et al., 200530. m/0.25 mm/0.25 μm, He; Program: 35C(5min) => 3C/min => 150C => 5C/min => 250C (10min)
CapillaryDB-Wax1740.Klesk and Qian, 200330. m/0.25 mm/0.5 μm, He; Program: 40C(2min) => 2C/min => 100C => 10C/min => 230C (5min)

Normal alkane RI, non-polar column, temperature ramp

View large format table.

Column type Active phase I Reference Comment
CapillaryHP-5 MS1164.Nawrath, Mgode, et al., 201230. m/0.25 mm/0.25 μm, Helium, 50. C @ 5. min, 5. K/min; Tend: 320. C
CapillaryVF-5 MS1165.Leffingwell and Alford, 201160. m/0.32 mm/0.25 μm, Helium, 2. K/min, 260. C @ 28. min; Tstart: 30. C
CapillaryVF-5 MS1167.Leffingwell and Alford, 201160. m/0.32 mm/0.25 μm, Helium, 2. K/min, 260. C @ 28. min; Tstart: 30. C
CapillaryHP-5 MS1162.Pino, Marquez, et al., 201030. m/0.32 mm/0.25 μm, Helium, 50. C @ 2. min, 4. K/min, 240. C @ 10. min
CapillaryHP-5 MS1167.Radulovic, Blagojevic, et al., 201030. m/0.25 mm/0.25 μm, Helium, 5. K/min, 290. C @ 10. min; Tstart: 70. C
CapillaryZB-51169.Alagarmalai, Nestel, et al., 200930. m/0.25 mm/0.25 μm, Helium, 60. C @ 2. min, 10. K/min, 230. C @ 10. min
CapillaryHP-5 MS1163.Raffo, Kelderer, et al., 200930. m/0.25 mm/0.25 μm, Helium, 40. C @ 2. min, 4. K/min, 250. C @ 5. min
CapillaryRTX-5 MS1174.Edris, Chizzola, et al., 200730. m/0.25 mm/0.25 μm, He, 60. C @ 2. min, 2. K/min, 200. C @ 10. min
CapillaryHP-51165.Farsam, Amanlou, et al., 200730. m/0.25 mm/0.26 μm, Helium, 60. C @ 2. min, 4. K/min, 240. C @ 20. min
CapillaryZB-51155.Mohottalage, Tabacchi, et al., 200730. m/0.25 mm/0.25 μm, 60. C @ 5. min, 4. K/min, 220. C @ 20. min
CapillaryHP-51162.Bertrand, Comte, et al., 200660. m/0.25 mm/0.25 μm, He, 3. K/min; Tstart: 60. C; Tend: 250. C
CapillaryHP-11129.Castel, Fernandez, et al., 200650. m/0.2 mm/0.5 μm, He, 2. K/min, 250. C @ 120. min; Tstart: 60. C
CapillaryUltra-21170.Schlumpberger B.O., Clery R.A., et al., 200650. m/0.25 mm/0.32 μm, He, 2. K/min; Tstart: 50. C; Tend: 270. C
CapillaryFSOT-RSL-2001160.Schmidt, Jirovetz, et al., 200630. m/0.32 mm/0.25 μm, Hydrogen, 40. C @ 5. min, 6. K/min, 280. C @ 5. min
CapillaryBPX-51178.Dickschat, Martens, et al., 200525. m/0.22 mm/0.25 μm, He, 50. C @ 5. min, 5. K/min; Tend: 320. C
CapillaryZB-51174.Dötterl and Jürgens, 200560. m/0.25 mm/0.25 μm, He, 40. C @ 7. min, 6. K/min, 250. C @ 1. min
CapillaryZB-51174.Dötterl, Wolfe, et al., 200560. m/0.25 mm/0.25 μm, He, 40. C @ 7. min, 6. K/min, 250. C @ 1. min
CapillaryHP-51163.0Leffingwell and Alford, 200560. m/0.32 mm/0.25 μm, He, 30. C @ 2. min, 2. K/min, 260. C @ 28. min
CapillaryHP-5MS1161.Setzer, Noletto, et al., 200530. m/0.25 mm/0.25 μm, He, 60. C @ 5. min, 3. K/min; Tend: 280. C
CapillaryHP-5MS1163.Tesevic, Nikicevic, et al., 200530. m/0.25 mm/0.25 μm, He, 4.3 K/min; Tstart: 60. C; Tend: 285. C
CapillarySPB-11136.Wong and Tan, 200550. m/0.2 mm/0.33 μm, He, 50. C @ 3. min, 4. K/min, 220. C @ 30. min
CapillaryZB-51180.Jürgens and Dötterl, 200460. m/0.25 mm/0.25 μm, He, 40. C @ 4.6 min, 6. K/min, 260. C @ 1. min
CapillaryDB-51160.Woerdenbag, Windono, et al., 200430. m/0.249 mm/0.25 μm, He, 3. K/min; Tstart: 60. C; Tend: 300. C
CapillaryOV-1011130.Agnaniet, Mounzeo, et al., 200325. m/0.25 mm/0.25 μm, N2, 5. K/min; Tstart: 50. C; Tend: 200. C
CapillaryDB-11127.Fekam Boyom, Ngouana, et al., 200330. m/0.25 mm/0.25 μm, N2, 5. K/min; Tstart: 50. C; Tend: 200. C
CapillaryOV-1011145.Bloss, Acree, et al., 200235. C @ 5. min, 6. K/min; Column length: 10. m; Column diameter: 0.25 mm; Tend: 225. C
CapillarySPB-51177.Kim, Kim, et al., 200060. m/0.25 mm/0.25 μm, He, 70. C @ 8. min, 5. K/min, 240. C @ 20. min
CapillaryHP-11134.Ong, Acree, et al., 19984. K/min; Column length: 25. m; Column diameter: 0.32 mm; Tstart: 35. C; Tend: 250. C
CapillaryDB-11133.Stashenko, Torres, et al., 199560. m/0.25 mm/0.25 μm, He, 50. C @ 5. min, 3.5 K/min; Tend: 250. C
CapillaryUltra-11133.Okumura, 199125. m/0.32 mm/0.25 μm, He, 3. K/min; Tstart: 80. C; Tend: 260. C
CapillaryCP Sil 8 CB1169.Jantan and Goh, 199060. C @ 10. min, 3. K/min; Column length: 25. m; Column diameter: 0.20 mm; Tend: 230. C
CapillaryOV-1011167.Wu, Zhao, et al., 1987He, 3. K/min; Column length: 45. m; Column diameter: 0.25 mm; Tstart: 100. C; Tend: 180. C
CapillaryDB-11128.Flath, Mon, et al., 198350. C @ 0.1 min, 4. K/min, 250. C @ 5. min; Column length: 60. m; Column diameter: 0.32 mm

Normal alkane RI, non-polar column, custom temperature program

View large format table.

Column type Active phase I Reference Comment
CapillaryPolydimethyl siloxane with 5 % Ph groups1165.Robinson, Adams, et al., 2012Program: not specified
CapillaryPolydimethyl siloxane with 5 % Ph groups1171.Robinson, Adams, et al., 2012Program: not specified
CapillarySiloxane, 5 % Ph1165.VOC BinBase, 2012Program: not specified
CapillaryPolydimethyl siloxane, 5 % phenyl1165.Skogerson, Wohlgemuth, et al., 2011Program: not specified
CapillaryZB-1 MS1160.Al-Reza, Rahman, et al., 201030. m/0.25 mm/0.25 μm, Helium; Program: 50 0C 3 0C/min -> 150 0C (10 min) 10 0C/min -> 250 0C
CapillaryCP-Sil 8 CB1166.Di Giusto, Bessiere, et al., 201030. m/0.25 mm/0.25 μm, Helium; Program: Multi-rise program
CapillaryHP-5 MS1162.Pino, Marquez, et al., 201030. m/0.32 mm/0.25 μm, Helium; Program: not specified
CapillaryRTX-51169.Leela, Vipin, et al., 200930. m/0.25 mm/0.25 μm, Nitrogen; Program: 60 0C 95 min) 110 0C 3 0C/min -> 200 0C 5 0C/min -> 220 0C 95 min)
CapillaryRTX-51162.Leela, Vipin, et al., 200930. m/0.25 mm/0.25 μm, Nitrogen; Program: not specified
CapillaryDB-11123.Mendes, Trindade, et al., 200930. m/0.25 mm/0.25 μm, Hydrogen; Program: 45 0C 3 0C/min -> 175 0C 15 0C/min -> 300 0C (10 min)
CapillaryCB-11144.Kannaste, Vongvanich, et al., 200830. m/0.25 mm/0.25 μm, Helium; Program: 40 0C (2 min) 4 0C/min -> 180 0C 20 0C/min -> 220 0C (1 min)
CapillaryCB-11134.Kannaste, Vongvanich, et al., 200830. m/0.25 mm/0.25 μm, Helium; Program: not specified
CapillaryCP Sil 8 CB1163.Kristiawan, Sobolik, et al., 200830. m/0.25 mm/0.25 μm; Program: 60C => 2.5C/min => 170C => 10C/min => 250C (5min)
CapillaryDB-51164.Beaulieu and Lancaster, 200730. m/0.25 mm/0.25 μm; Program: 50C(1min) => 5C/min => 100C => 10C/min => 250C (9min)
CapillaryCP-Sil1163.Proffit, 200730. m/0.25 mm/0.25 μm, Helium; Program: 50 0C (3 min) 3 0C/min -> 100 0C 2.7 0C/min -> 140 0C 2.4 0C/min -> 180 0C 6 0C/min -> 250 0C
CapillaryDB-51164.Beaulieu, 200560. m/0.25 mm/0.25 μm; Program: 50C => 5C/min => 100C => 15C/min => 250C (19C)
CapillaryPolydimethyl siloxane with 5 % Ph groups1163.Pino, Marbot, et al., 2005Program: not specified
CapillarySPB-51163.Crook, Boylston, et al., 200430. m/0.25 mm/0.25 μm, He; Program: 30C(3min) => 5C/min => 80C => 4C/min => 95C => 5C/min => 115C => 10C/min => 200C
CapillarySE-301144.Vinogradov, 2004Program: not specified
CapillaryHP-51162.Jordán, Margaría, et al., 200330. m/0.25 mm/0.25 μm; Program: 40C(6min) => 2.5C/min => 150C => 90C/min => 250C
CapillaryHP-51169.1David, Scanlan, et al., 200250. m/0.32 mm/1.05 μm, He; Program: not specified
CapillaryHP-51163.Jordán, Goodner, et al., 200230. m/0.25 mm/0.25 μm; Program: not specified
CapillaryHP-51161.Jordán, Goodner, et al., 200230. m/0.25 mm/0.25 μm; Program: not specified
CapillaryHP-11133.Teai, Claude-Lafontaine, et al., 200150. m/0.32 mm/0.52 μm, N2; Program: 40C => 2C/min => 130C => 4C/min => 250C
CapillaryDB-11123.Baratta, Dorman, et al., 199830. m/0.25 mm/0.25 μm, He; Program: 45C => 3C/min => 175C => 15C/min => 240C (10min)
CapillaryHP-11134.Ong, Acree, et al., 1998Column length: 25. m; Column diameter: 0.32 mm; Program: not specified
CapillaryPolydimethyl siloxanes1136.Zenkevich and Chupalov, 1996Program: not specified
CapillaryOV-1011144.Shibamoto, 1987Program: not specified
CapillaryOV-1011144.Wu, Zhao, et al., 1987He; Column length: 45. m; Column diameter: 0.25 mm; Program: not specified
CapillaryOV-1011146.Zenkevich and Malamakhov, 1987He; Column length: 50. m; Column diameter: 0.24 mm; Program: not specified

Normal alkane RI, polar column, temperature ramp

View large format table.

Column type Active phase I Reference Comment
CapillaryHP-Innowax1743.Soria, Sanz, et al., 200850. m/0.20 mm/0.20 μm, Helium, 45. C @ 2. min, 4. K/min, 190. C @ 50. min
CapillaryDB-Wax1765.Wei A. and Shibamoto T., 200760. m/0.25 mm/0.25 μm, He, 60. C @ 8. min, 3. K/min, 180. C @ 80. min
CapillaryInnowax1739.Joichi, Yomogida, et al., 200560. m/0.25 mm/0.25 μm, He, 5. K/min, 240. C @ 30. min; Tstart: 60. C
CapillarySupelcowax-101725.Wong and Tan, 200530. m/0.25 mm/0.25 μm, He, 50. C @ 3. min, 4. K/min, 220. C @ 30. min
CapillaryPEG-20M1720.Narain, Almeida, et al., 200450. m/0.20 mm/0.20 μm, 40. C @ 5. min, 3. K/min, 180. C @ 30. min
CapillaryHP-Innowax1746.Soria, Gonzalez, et al., 200450. m/0.2 mm/0.2 μm, He, 45. C @ 2. min, 4. K/min, 190. C @ 50. min
CapillaryCarbowax 20M1714.Agnaniet, Mounzeo, et al., 200325. m/0.22 mm/0.25 μm, N2, 5. K/min; Tstart: 50. C; Tend: 200. C
CapillaryDB-Wax1726.Hayata, Sakamoto, et al., 200260. m/0.25 mm/0.25 μm, He, 40. C @ 10. min, 3. K/min, 220. C @ 10. min
CapillaryDB-Wax1743.Ito, Sugimoto, et al., 200260. C @ 4. min, 3. K/min; Column length: 60. m; Column diameter: 0.25 mm; Tend: 180. C
CapillaryDB-Wax1727.Lee and Shibamoto, 200130. m/0.25 mm/0.25 μm, He, 3. K/min, 180. C @ 40. min; Tstart: 50. C
CapillarySupelcowax-101703.Kim, Kim, et al., 200030. m/0.32 mm/0.25 μm, He, 70. C @ 8. min, 5. K/min, 240. C @ 20. min
CapillaryPEG-20M1738.Hirose, Joichi, et al., 1999N2, 3. K/min; Column length: 60. m; Column diameter: 0.25 mm; Tstart: 70. C; Tend: 220. C
CapillaryPEG-20M1738.Awano, Honda, et al., 1997He, 3. K/min; Column length: 60. m; Column diameter: 0.25 mm; Tstart: 70. C; Tend: 210. C
CapillaryDB-Wax1692.Stashenko, Torres, et al., 199560. m/0.25 mm/0.25 μm, He, 50. C @ 5. min, 2.5 K/min; Tend: 180. C
CapillaryCarbowax 20M1686.Kawakami and Kobayashi, 1991He, 60. C @ 4. min, 2. K/min; Column length: 50. m; Column diameter: 0.25 mm; Tend: 180. C
CapillarySupelcowax-101759.Loughrin, Hamilton-Kemp, et al., 1990He, 60. C @ 1. min, 2. K/min; Column length: 60. m; Column diameter: 0.32 mm; Tend: 220. C

Normal alkane RI, polar column, custom temperature program

View large format table.

Column type Active phase I Reference Comment
CapillaryDB-Wax1689.Parker, Tsormpatsidis, et al., 2010Program: not specified
CapillaryHP-20M1714.Chaieb, Hajlaoui, et al., 2007Program: not specified
CapillaryHP-Innowax1689.Quijano and Pino, 200660. m/0.25 mm/0.25 μm, Nitrogen; Program: 50 0C (4 min) -> 40 0C 4 0C/min -> 220 0C
CapillaryDB-FFAP1704.Buettner and Mestres, 200530. m/0.32 mm/0.25 μm; Program: 35C(2min) => 40C/min => 60C(2min) => 6C/min => 180C => 10C/min=230C(10min)
CapillaryCP-Wax 52CB1695.Jales, Maia, et al., 2005Hydrogen; Program: not specified
CapillaryCarbowax 20M1697.Vinogradov, 2004Program: not specified
CapillaryCarbowax 20M1690.Teai, Claude-Lafontaine, et al., 200150. m/0.2 mm/0.2 μm, N2; Program: 60C => 2C/min => 150C => 4C/min => 220C
CapillaryCarbowax 20M1697.Shibamoto, 1987Program: not specified
CapillaryCarbowax 400, Carbowax 20M, Carbowax 1540, Carbowax 4000, Superox 06, PEG 20M, etc.1728.Waggott and Davies, 1984Hydrogen; Column length: 50. m; Column diameter: 0.32 mm; Program: not specified

References

Fuchs, 1979
Fuchs, R.,
Heat capacities of some liquid aliphatic, alicyclic, and aromatic esters at 298.15 K,
J. Chem. Thermodyn., 1979, 11, 959-961. [all data]
Phillip, 1939
Phillip, N.M.,
Adiabatic and isothermal compressibilities of liquids,
Proc. Indian Acad. Sci., 1939, A9, 109-120. [all data]
Kolosovskii and Udovenko, 1934
Kolosovskii, N.A.; Udovenko, W.W.,
Specific heat of liquids. II.,
Zhur. Obshchei Khim., 1934, 4, 1027-1033. [all data]
de Kolossowsky and Udowenko, 1933
de Kolossowsky, N.A.; Udowenko, W.W.,
Mesure des chaleurs specifique moleculaires de quelques liquides,
Compt. rend., 1933, 197, 519-520. [all data]
Aldrich Chemical Company Inc., 1990
Aldrich Chemical Company Inc.,
Catalog Handbook of Fine Chemicals, Aldrich Chemical Company, Inc., Milwaukee WI, 1990, 1. [all data]
American Tokyo Kasei, 1988
American Tokyo Kasei,
TCI American Organic Chemical 88/89 Catalog, American Tokyo Kasei, Portland, OR, 1988, 1610. [all data]
Katti and Chaudhri, 1964
Katti, P.K.; Chaudhri, M.M.,
Boiling Points and Surface Tension of Mixtures of Benzyl Acetate with Dioxane, Aniline, and Meta-Cresol,
J. Chem. Eng. Data, 1964, 9, 128. [all data]
Lecat, 1927
Lecat, M.,
New binary azeotropes: 6th list,
Ann. Soc. Sci. Bruxelles, Ser. B, 1927, 47, 63-71. [all data]
Lecat, 1926
Lecat, M.,
New binary azeotropes: 3rd list,
Ann. Soc. Sci. Bruxelles, Ser. B, 1926, 45, 284-94. [all data]
Timmermans, 1921
Timmermans, J.,
The Freezing Points of Organic Substances IV. New Exp. Determinations,
Bull. Soc. Chim. Belg., 1921, 30, 62. [all data]
Stephenson and Malanowski, 1987
Stephenson, Richard M.; Malanowski, Stanislaw,
Handbook of the Thermodynamics of Organic Compounds, 1987, https://doi.org/10.1007/978-94-009-3173-2
. [all data]
Buckingham and Donaghy, 1982
Buckingham, J.; Donaghy, S.M.,
Dictionary of Organic Compounds: Fifth Edition, Chapman and Hall, New York, 1982, 1. [all data]
Serpinskii, Voitkevich, et al., 1954
Serpinskii, V.V.; Voitkevich, S.A.; Lyuboshits, N.Y.,
Zh. Fiz. Khim., 1954, 28, 810. [all data]
Gardner and Brewer, 1937
Gardner, George S.; Brewer, J. Edward,
Vapor Pressure of Commerical High-Boiling Organic Solvents,
Ind. Eng. Chem., 1937, 29, 2, 179-181, https://doi.org/10.1021/ie50326a014
. [all data]
Zlatkis, Lee, et al., 1983
Zlatkis, A.; Lee, C.K.; Wentworth, W.E.; Chen, E.C.M.,
Constant current linearization for determination of electron capture mechanisms,
Anal. Chem., 1983, 55, 1596. [all data]
Field, 1969
Field, F.H.,
Chemical Ionization Mass Spectrometry. IX. Temperature and Pressure Studies with Benzyl Acetate and t-Amyl Acetate,
J. Am. Chem. Soc., 1969, 91, 11, 2827, https://doi.org/10.1021/ja01039a002
. [all data]