Heptadecanoic acid, ethyl ester
- Formula: C19H38O2
- Molecular weight: 298.5038
- IUPAC Standard InChIKey: KNXMUFRWYNVISA-UHFFFAOYSA-N
- CAS Registry Number: 14010-23-2
- Chemical structure:

Phase change data

Data compiled as indicated in comments:
BS - Robert L. Brown and Stephen E. Stein
AC - William E. Acree, Jr., James S. Chickos
DH - Eugene S. Domalski and Elizabeth D. Hearing
Reduced pressure boiling point
Tboil (K) | Pressure (bar) | Reference | Comment |
---|---|---|---|
458.2 | 0.007 | Weast and Grasselli, 1989 | BS |
Enthalpy of fusion
ΔfusH (kJ/mol) | Temperature (K) | Reference | Comment |
---|---|---|---|
36.2 | 298.4 | King and Garner, 1936 | AC |
Enthalpy of phase transition
ΔHtrs (kJ/mol) | Temperature (K) | Initial Phase | Final Phase | Reference | Comment |
---|---|---|---|---|---|
4.946 | 298.3 | crystaline, II | crystaline, I | King and Garner, 1936, 2 | Heat of transition at meltin point.; DH |

Kovats' RI, non-polar column, isothermal

Data compiled by: NIST Mass Spectrometry Data Center, William E. Wallace, director

Column type CapillaryCapillaryCapillary
Active phase SE-30SE-30SE-30
Column length (m) 25.25.25.
Carrier gas N2N2N2
Substrate
Column diameter (mm) 0.330.330.33
Phase thickness (μm)
Temperature (C) 180.200.220.
I 2074.2078.2082.
ReferenceKorhonen, 1985Korhonen, 1985Korhonen, 1985
Comment MSDC-RI MSDC-RI MSDC-RI

Kovats' RI, polar column, isothermal

View large format table.

Column type Active phase Temperature (C) I Reference Comment
CapillaryOV-351120.2342.Korhonen, 1985N2; Column length: 25. m; Column diameter: 0.32 mm
CapillaryOV-351140.2348.Korhonen, 1985N2; Column length: 25. m; Column diameter: 0.32 mm
CapillaryOV-351160.2343.Korhonen, 1985N2; Column length: 25. m; Column diameter: 0.32 mm
CapillaryOV-351180.2359.Korhonen, 1985N2; Column length: 25. m; Column diameter: 0.32 mm
CapillaryOV-351200.2357.Korhonen, 1985N2; Column length: 25. m; Column diameter: 0.32 mm
CapillaryOV-351220.2370.Korhonen, 1985N2; Column length: 25. m; Column diameter: 0.32 mm

Van Den Dool and Kratz RI, non-polar column, temperature ramp

View large format table.

Column type Active phase I Reference Comment
CapillarySE-302077.Korhonen, 1985N2, 6. K/min; Column length: 25. m; Column diameter: 0.33 mm; Tstart: 100. C; Tend: 320. C

Van Den Dool and Kratz RI, non-polar column, custom temperature program

View large format table.

Column type Active phase I Reference Comment
CapillaryHP-52098.Isidorov, Krajewska, et al., 200130. m/0.25 mm/0.25 μm, He; Program: 50C => 6C/min => 100C => 4C/min => 280C

Van Den Dool and Kratz RI, polar column, temperature ramp

View large format table.

Column type Active phase I Reference Comment
CapillaryCP-Wax 52CB2349.Mahadevan and Farmer, 200660. C @ 5. min, 4. K/min, 220. C @ 30. min; Column length: 50. m; Column diameter: 0.32 mm
CapillarySupelcowax-102330.Chung, Fung, et al., 200560. m/0.25 mm/0.25 μm, 35. C @ 5. min, 6. K/min, 195. C @ 60. min
CapillaryZB-Wax2355.Ledauphin, Saint-Clair, et al., 200430. m/0.25 mm/0.15 μm, He, 35. C @ 10. min, 1.8 K/min, 220. C @ 10. min
CapillaryOV-3512349.Korhonen, 1985N2, 6. K/min; Column length: 25. m; Column diameter: 0.32 mm; Tstart: 100. C; Tend: 230. C

Van Den Dool and Kratz RI, polar column, custom temperature program

View large format table.

Column type Active phase I Reference Comment
CapillaryDB-Wax2340.Ferrari, Lablanquie, et al., 200460. m/0.25 mm/0.25 μm, He; Program: 35C(0.7min) => 20C/min => 70C => 4C/min => 240C

Normal alkane RI, non-polar column, temperature ramp

View large format table.

Column type Active phase I Reference Comment
CapillaryDB-52089.Woerdenbag, Windono, et al., 200430. m/0.249 mm/0.25 μm, He, 3. K/min; Tstart: 60. C; Tend: 300. C
CapillaryUltra-12075.Okumura, 199125. m/0.32 mm/0.25 μm, He, 3. K/min; Tstart: 80. C; Tend: 260. C

Normal alkane RI, polar column, temperature ramp

View large format table.

Column type Active phase I Reference Comment
CapillaryDB-Wax2383.Choi, 200660. m/0.25 mm/0.25 μm, N2, 70. C @ 2. min, 2. K/min, 230. C @ 20. min
CapillaryDB-Wax2365.Choi, 200460. m/0.25 mm/0.25 μm, N2, 70. C @ 2. min, 2. K/min, 230. C @ 20. min

References

Weast and Grasselli, 1989
CRC Handbook of Data on Organic Compounds, 2nd Editon, Weast,R.C and Grasselli, J.G., ed(s)., CRC Press, Inc., Boca Raton, FL, 1989, 1. [all data]
King and Garner, 1936
King, A. Millicent; Garner, William E.,
297. The heats of crystallisation of methyl and ethyl esters of monobasic fatty acids,
J. Chem. Soc., 1936, 1372, https://doi.org/10.1039/jr9360001372
. [all data]
King and Garner, 1936, 2
King, A.M.; Garner, W.E.,
The heats of crystallization of methyl and ethyl esters of monobasic fatty acids, 1936, J. [all data]