(dimethylamino)methanol
- Formula: C3H9NO
- Molecular weight: 75.1097
- IUPAC Standard InChIKey: XQKRYBXCYCKQLL-UHFFFAOYSA-N
- CAS Registry Number: 14002-21-2
- Chemical structure:
View 3d structure (requires JavaScript / HTML 5) - Permanent link for this species. Use this link for bookmarking this species for future reference.

Gas phase thermochemistry data

Data compiled by: Hussein Y. Afeefy, Joel F. Liebman, and Stephen E. Stein
Quantity | Value | Units | Method | Reference | Comment |
---|---|---|---|---|---|
ΔfH°gas | -203.3 ± 4.4 | kJ/mol | Cm | Rogers and Rapiejko, 1974 | Heat of formation derived by 77PED/RYL |

Condensed phase thermochemistry data

Data compiled by: Hussein Y. Afeefy, Joel F. Liebman, and Stephen E. Stein
Quantity | Value | Units | Method | Reference | Comment |
---|---|---|---|---|---|
ΔfH°liquid | -253.6 ± 1.2 | kJ/mol | Cm | Rogers and Rapiejko, 1974 | Heat of formation derived by 77PED/RYL |

Phase change data

Data compiled by: Hussein Y. Afeefy, Joel F. Liebman, and Stephen E. Stein
Quantity | Value | Units | Method | Reference | Comment |
---|---|---|---|---|---|
ΔvapH° | 50.2 ± 4.2 | kJ/mol | E | Rogers and Rapiejko, 1974 | Heat of formation derived by 77PED/RYL |

Reaction thermochemistry data

Data compiled by: Hussein Y. Afeefy, Joel F. Liebman, and Stephen E. Stein
Individual Reactions
By formula: C3H9NO = C2H7N + CH2O
Quantity | Value | Units | Method | Reference | Comment |
---|---|---|---|---|---|
ΔrH° | 126. ± 0.8 | kJ/mol | Cm | Rogers and Rapiejko, 1974 | liquid phase; Heat of formation derived by 77PED/RYL |
By formula: C2H7N + CH2O = C3H9NO
Quantity | Value | Units | Method | Reference | Comment |
---|---|---|---|---|---|
ΔrH° | -126. ± 0.8 | kJ/mol | Cm | Rogers and Rapiejko, 1974 | gas phase |

References

Rogers and Rapiejko, 1974
Rogers, F.E.; Rapiejko, R.J.,
Thermochemistry of carbonyl addition reactions. II. Enthalpy of addition of dimethylamine to formaldehyde,
J. Phys. Chem., 1974, 78, 599-603. [all data]