trans-2-Pentenoic acid
- Formula: C5H8O2
- Molecular weight: 100.1158
- IUPAC Standard InChIKey: YIYBQIKDCADOSF-ONEGZZNKSA-N
- CAS Registry Number: 13991-37-2
- Chemical structure:
View 3d structure (requires JavaScript / HTML 5) - Stereoisomers:
- Other names: 2-Pentenoic acid, (E)-; (2E)-2-Pentenoic acid; (E)-2-Pentenoic acid; (E)-pent-2-en-1-oic acid; trans-Alpha,beta-penteneoic acid

Condensed phase thermochemistry data

Data compiled by: Hussein Y. Afeefy, Joel F. Liebman, and Stephen E. Stein
Quantity | Value | Units | Method | Reference | Comment |
---|---|---|---|---|---|
ΔcH°liquid | -4020. | kJ/mol | Cm | Schjanberg, 1938 | Corresponding ΔfHºliquid = 909.2 kJ/mol (simple calculation by NIST; no Washburn corrections) |

Phase change data

Data compiled by: Thermodynamics Research Center, NIST Boulder Laboratories, Chris Muzny director
Quantity | Value | Units | Method | Reference | Comment |
---|---|---|---|---|---|
Tc | 676.92 | K | N/A | D'Souza and Teja, 1987 | Uncertainty assigned by TRC = 3. K; Ambrose's procedure |
Quantity | Value | Units | Method | Reference | Comment |
Pc | 43.5056 | bar | N/A | D'Souza and Teja, 1987 | Uncertainty assigned by TRC = 1.00 bar; Ambrose's procedure |

Gas phase ion energetics data

Data evaluated by: Edward P. Hunter and Sharon G. Lias
Quantity | Value | Units | Method | Reference | Comment |
---|---|---|---|---|---|
Proton affinity (review) | 823.6 | kJ/mol | N/A | Hunter and Lias, 1998 | |
Quantity | Value | Units | Method | Reference | Comment |
Gas basicity | 792.6 | kJ/mol | N/A | Hunter and Lias, 1998 |

References

Schjanberg, 1938
Schjanberg, E.,
Cis-pentensyreetylestrarnas forbranningsvarmen, refraktionsdata och alkaliska hydrolys,
Svensk. Kim. Tidr., 1938, 50, 102-106. [all data]
D'Souza and Teja, 1987
D'Souza, R.; Teja, A.S.,
The prediction of the vapor pressures of carboxylic acids,
Chem. Eng. Commun., 1987, 61, 13. [all data]
Hunter and Lias, 1998
Hunter, E.P.; Lias, S.G.,
Evaluated Gas Phase Basicities and Proton Affinities of Molecules: An Update,
J. Phys. Chem. Ref. Data, 1998, 27, 3, 413-656, https://doi.org/10.1063/1.556018
. [all data]