2-ethyl-1,3,5-trinitrobenzene
- Formula: C8H7N3O6
- Molecular weight: 241.1577
- IUPAC Standard InChIKey: VDKWJWFQFPWXFC-UHFFFAOYSA-N
- CAS Registry Number: 13985-60-9
- Chemical structure:
View 3d structure (requires JavaScript / HTML 5) - Permanent link for this species. Use this link for bookmarking this species for future reference.

Condensed phase thermochemistry data

Data compiled by: Hussein Y. Afeefy, Joel F. Liebman, and Stephen E. Stein
Quantity | Value | Units | Method | Reference | Comment |
---|---|---|---|---|---|
ΔfH°solid | -71.5 | kJ/mol | Ccb | Medard and Thomas, 1954 | |
ΔfH°solid | -67.82 | kJ/mol | Ccb | Medard, 1954 | Heat of combustion corrected for pressure |
Quantity | Value | Units | Method | Reference | Comment |
ΔcH°solid | -4077. | kJ/mol | Ccb | Medard and Thomas, 1954 | |
ΔcH°solid | -4080.7 | kJ/mol | Ccb | Medard, 1954 | Heat of combustion corrected for pressure |

References

Medard and Thomas, 1954
Medard, L.; Thomas, M.,
Chaleurs de combustion de vingt-quatre substances explosives ou apparentees a des explosifs,
Mem. Poudres, 1954, 36, 97-127. [all data]
Medard, 1954
Medard, L.,
Tables thermochimiques a l'usage des techniciens des substances explosives,
Mem. Artillerie Fr. Sci. Tech. Armement, 1954, 28, 415-492. [all data]