deuterium hydride
- Formula: DH
- Molecular weight: 3.02204
- IUPAC Standard InChIKey: UFHFLCQGNIYNRP-OUBTZVSYSA-N
- CAS Registry Number: 13983-20-5
- Chemical structure:
View 3d structure (requires JavaScript / HTML 5) - Isotopologues:

Gas phase thermochemistry data

Quantity | Value | Units | Method | Reference | Comment |
---|---|---|---|---|---|
ΔfH°gas | 0.32 | kJ/mol | Review | Chase, 1998 | Data last reviewed in June, 1977 |
Quantity | Value | Units | Method | Reference | Comment |
S°gas,1 bar | 143.80 | J/mol*K | Review | Chase, 1998 | Data last reviewed in June, 1977 |
Gas Phase Heat Capacity (Shomate Equation)
Cp° = A + B*t + C*t2 + D*t3 +
E/t2
H° − H°298.15= A*t + B*t2/2 +
C*t3/3 + D*t4/4 − E/t + F − H
S° = A*ln(t) + B*t + C*t2/2 + D*t3/3 −
E/(2*t2) + G
Cp = heat capacity (J/mol*K)
H° = standard enthalpy (kJ/mol)
S° = standard entropy (J/mol*K)
t = temperature (K) / 1000.
View plot Requires a JavaScript / HTML 5 canvas capable browser.
Temperature (K) | 298. to 1000. | 1000. to 6000. |
---|---|---|
A | 31.24992 | 28.22296 |
B | -7.589190 | 4.575371 |
C | 9.011375 | -0.551669 |
D | -1.914415 | 0.031038 |
E | -0.047793 | -1.732276 |
F | -8.896315 | -10.94434 |
G | 183.2291 | 174.3448 |
H | 0.320000 | 0.320000 |
Reference | Chase, 1998 | Chase, 1998 |
Comment | Data last reviewed in June, 1977 | Data last reviewed in June, 1977 |

Phase change data

Data compiled by: Thermodynamics Research Center, NIST Boulder Laboratories, Chris Muzny director
Quantity | Value | Units | Method | Reference | Comment |
---|---|---|---|---|---|
Ttriple | 16.6 | K | N/A | Clusius and Weigand, 1940 | Uncertainty assigned by TRC = 0.2 K; see property X for dP/dT for c-l equil. |

Constants of diatomic molecules

Data compiled by: Klaus P. Huber and Gerhard H. Herzberg
Symbol | Meaning |
---|---|
State | electronic state and / or symmetry symbol |
Te | minimum electronic energy (cm-1) |
ωe | vibrational constant – first term (cm-1) |
ωexe | vibrational constant – second term (cm-1) |
ωeye | vibrational constant – third term (cm-1) |
Be | rotational constant in equilibrium position (cm-1) |
αe | rotational constant – first term (cm-1) |
γe | rotation-vibration interaction constant (cm-1) |
De | centrifugal distortion constant (cm-1) |
βe | rotational constant – first term, centrifugal force (cm-1) |
re | internuclear distance (Å) |
Trans. | observed transition(s) corresponding to electronic state |
ν00 | position of 0-0 band (units noted in table) |
State | Te | ωe | ωexe | ωeye | Be | αe | γe | De | βe | re | Trans. | ν00 |
---|---|---|---|---|---|---|---|---|---|---|---|---|
k 3Πu 4pπ | (118384.2) | 2030.56 | 50.36 1 | 20.548 | 0.951 | .0092 | 1.0550 | k → a R | 22295.24 | |||
↳Cunningham and Dieke, 1950 | ||||||||||||
d 3Πu 3pπ | (112717.4) | 2054.59 2 | 49.74 3 | 22.810 2 4 | 1.020 | [.0116] | 1.0489 | d → a R | 16640.6 | |||
↳Dieke and Blue, 1935 | ||||||||||||
e 3Σu+ 3pσ | (107776.6) | 1905.17 | 51.70 5 | 20.766 | 1.010 | [.0089] | 1.0993 | e → a R | 11624.6 | |||
↳Dieke, 1935 | ||||||||||||
a 3Σg+ 2sσ | (95947.1) 6 | 2308.44 | 53.77 7 | 25.685 | 1.099 | [.0128] | .9885 | (a-X) | (925201.5) 6 | |||
c 3Πu 2pπ | No constants of this state have yet been determined. 8 | |||||||||||
State | Te | ωe | ωexe | ωeye | Be | αe | γe | De | βe | re | Trans. | ν00 |
b 3Σu+ 2pσ 9 | a → b | |||||||||||
Ionization continua joining on to Rydberg series. 10 | ||||||||||||
Rydberg series of rotational levels observed in low temperature absorption from X 1Σg+ (v=0) and converging to: | ||||||||||||
N=2 (v=1) of HD+ | J=1 (v=1) levels of npπ 1Πu+ (n=36...46) 11 12; | |||||||||||
N=2 (v=1) of HD+ 13 | R(0) lines | |||||||||||
↳Takezawa and Tanaka, 1972 | ||||||||||||
N=1 (v=0) of HD+ | J=1 (v=0) levels of npπ 1Πu- (n=6...23, joining on to C, D, D', D"); | |||||||||||
State | Te | ωe | ωexe | ωeye | Be | αe | γe | De | βe | re | Trans. | ν00 |
N=1 (v=0) of HD+ 14 | Q(1) lines | |||||||||||
↳Takezawa and Tanaka, 1972 | ||||||||||||
N=0 (v=0) of HD+ | J=1 (v=0) levels of npσ 1Σu+ (n=5...48, joining on to B, B', B") 12 ; | |||||||||||
N=0 (v=0) of HD+ 15 | R(0) lines | |||||||||||
↳Takezawa and Tanaka, 1972 | ||||||||||||
B bar 1Σu+ | see 1H2. | |||||||||||
↳Dabrowski and Herzberg, 1974; Chupka, Dehmer, et al., 1975 | ||||||||||||
State | Te | ωe | ωexe | ωeye | Be | αe | γe | De | βe | re | Trans. | ν00 |
D" 1Πu 5pπ | 121231.2 16 | 2006.17 17 | 45.801 17 | [22.865] 18 | 19 | [0.021] | [1.0477] | D" ← X R | 120332.6 16 | |||
↳Monfils, 1965; Monfils, 1968 | ||||||||||||
121216.3 16 | 2006.17 | 45.801 | [22.144] | [0.013] | [1.0646] | D" ← X R | 120317.7 16 | |||||
↳Monfils, 1965; Monfils, 1968 | ||||||||||||
D' 1Πu 4pπ | 118879.2 17 | 2014.91 17 | 47.018 | 0.1266 | 22.35 20 18 | 1.25 | -0.05 | [0.022] 20 | 1.06 | D' ← X R | 117984.7 | |
↳Monfils, 1965; Monfils, 1968 | ||||||||||||
B" 1Σu+ 4pσ | 117980.4 | 1896.60 | 48.924 | 20.34 21 | 0.398 21 | [0.025] | 1.111 | B" ← X R | 117026.2 | |||
↳Monfils, 1965; Monfils, 1968 | ||||||||||||
State | Te | ωe | ωexe | ωeye | Be | αe | γe | De | βe | re | Trans. | ν00 |
M 1Σg+ | [115073] | [10.4] | [1.55] | M → B R | 22782.5 | |||||||
↳Dieke and Lewis, 1937 | ||||||||||||
D 1Πu 3pπ | 113901.7 22 | 2039.13 17 | 48.917 23 | 0.2171 | 22.91 24 18 | 0.97 25 | (0.012) 26 | 1.047 | D ← X 27 R | 113018.84 28 | ||
↳Monfils, 1965; Monfils, 1968 | ||||||||||||
J 1Δg 3dδ | (113536) | [1832.8] 29 | J → B V | 22162.3 29 | ||||||||
↳Dieke and Lewis, 1937 | ||||||||||||
I 1Πg 3dπ | (113110) | 1962.14 24 | 58.21 30 | 22.36 24 | 1.21 | [0.007] | 1.059 | I → B V | 21786.2 31 | |||
↳Dieke and Lewis, 1937 | ||||||||||||
State | Te | ωe | ωexe | ωeye | Be | αe | γe | De | βe | re | Trans. | ν00 |
G 1Σg+ 3dσ | (112843) | [1879.9] 32 | G → B R | 21492.4 | ||||||||
↳Dieke and Lewis, 1937 | ||||||||||||
K (1Σg+) | (112663) | [(1981)] 33 | K → B R | (21363.2) 34 | ||||||||
↳Dieke and Lewis, 1937 | ||||||||||||
B' 1Σu+ 3pσ | 111649.7 35 | 1775.2 | 67.66 36 30 | 3.66 | 20 37 18 | 1.28 37 | [0.0016] 37 | 1.120 | B' ← X 27 R | 110632.58 | ||
↳Monfils, 1965; Monfils, 1968; Dabrowski and Herzberg, 1976 | ||||||||||||
F 1Σg+ 2pσ2 | 100927.5 38 39 | (1087.9) 40 | (21.6) 40 41 | E → B V | 8901.72 | |||||||
↳Dieke, 1936; Dabrowski and Herzberg, 1976 | ||||||||||||
State | Te | ωe | ωexe | ωeye | Be | αe | γe | De | βe | re | Trans. | ν00 |
E 1Σg+ 2sσ | 100120.4 38 39 | 2204.4 42 | 81.6 42 | 24.568 42 | 1.288 42 | [0.0123] | 1.0107 | E,F ← X 43 R | 99301.59 44 | |||
↳missing citation | ||||||||||||
C 1Πu 2pπ | 100092.9 45 | 2119.65 | 53.31 46 | 0.656 | 23.522 47 | 1.096 48 | 0.0149 49 | -0.00077 | 1.0329 | C ↔ X 50 51 R | 99252.86 | |
↳Monfils, 1965; Monfils, 1968; missing citation | ||||||||||||
B 1Σu+ 2pσ | 91698.3 45 | 1177.16 | 15.59 52 | 15.071 47 | 0.82 53 | 0.00882 | -0.000505 | 1.2904 | B ↔ X 54 51 R | 90399.86 | ||
↳missing citation; missing citation | ||||||||||||
X 1Σg+ 1sσ2 | 0 | 3813.15 | 91.65 55 | 45.655 56 | 1.986 57 | 0.02605 58 | -0.00054 | 0.74142 59 | ||||
↳Durie and Herzberg, 1960; McKellar, Goetz, et al., 1976 | ||||||||||||
Pure rotation sp. 60 | ||||||||||||
↳Trefler and Gush, 1968 | ||||||||||||
Raman sp. | ||||||||||||
↳Stoicheff, 1957 | ||||||||||||
Field- and | ||||||||||||
↳Brannon, Church, et al., 1968 | ||||||||||||
collision induced sp. | ||||||||||||
↳Prasad and Reddy, 1975 | ||||||||||||
Rf magn. reson. sp. 61 | ||||||||||||
↳Kellogg, Rabi, et al., 1940; Ramsey, 1940 |

Gas phase ion energetics data

Data compiled as indicated in comments:
LL - Sharon G. Lias and Joel F. Liebman
LLK - Sharon G. Lias, Rhoda D. Levin, and Sherif A. Kafafi
RDSH - Henry M. Rosenstock, Keith Draxl, Bruce W. Steiner, and John T. Herron
Ionization energy determinations
IE (eV) | Method | Reference | Comment |
---|---|---|---|
15.44465 | EVAL | Shiner, Gilligan, et al., 1993 | LL |
15.44466 | EVAL | Huber and Herzberg, 1979 | LLK |
15.44477 ± 0.00007 | S | Takezawa and Tanaka, 1972 | LLK |
15.46 | PI | Dibeler, Reese, et al., 1965 | RDSH |

References

Chase, 1998
Chase, M.W., Jr.,
NIST-JANAF Themochemical Tables, Fourth Edition,
J. Phys. Chem. Ref. Data, Monograph 9, 1998, 1-1951. [all data]
Clusius and Weigand, 1940
Clusius, K.; Weigand, K.,
Melting Curves of the Gases A, Kr, Xe, CH4, CH3D, CD4, C2H4, C2H6, COS, and PH3 to 200 Atmospheres Pressure. The Chane of Volume on Melting,
Z. Phys. Chem., Abt. B, 1940, 46, 1-37. [all data]
Cunningham and Dieke, 1950
Cunningham; Dieke,
Johns Hopkins University, Department of Physics, Rpt. NYO-692, 1950, 1. [all data]
Dieke and Blue, 1935
Dieke, G.H.; Blue, R.W.,
The Fulcher bands of HD and D2,
Phys. Rev., 1935, 47, 261. [all data]
Dieke, 1935
Dieke, G.H.,
The 3p3Σ→2s3Σ bands of HD and D2,
Phys. Rev., 1935, 48, 606. [all data]
Takezawa and Tanaka, 1972
Takezawa, S.; Tanaka, Y.,
Absorption spectrum of HD in the vacuum-uv region. Rydberg states and ionization energy,
J. Chem. Phys., 1972, 56, 6125. [all data]
Dabrowski and Herzberg, 1974
Dabrowski, I.; Herzberg, G.,
The absorption spectrum of D2 from 1100 to 840 Å,
Can. J. Phys., 1974, 52, 1110. [all data]
Chupka, Dehmer, et al., 1975
Chupka, W.A.; Dehmer, P.M.; Jivery, W.T.,
High resolution photoionization study of ion-pair formation in H2, HD, and D2,
J. Chem. Phys., 1975, 63, 3929. [all data]
Monfils, 1965
Monfils, A.,
The absorption spectra of the molecules H2, HD, and D2. Part VI. Rotational analysis of the B', B", D, D', and D" states,
J. Mol. Spectrosc., 1965, 15, 265. [all data]
Monfils, 1968
Monfils, A.,
Absorption spectra of molecules H2, HD, and D2. VII. Vibrational constants of the B, B', B", C, D, D', and D" states,
J. Mol. Spectrosc., 1968, 25, 513. [all data]
Dieke and Lewis, 1937
Dieke, G.H.; Lewis, M.N.,
Bands of HD and D2 ending on the 2p1Σ state,
Phys. Rev., 1937, 52, 100. [all data]
Dabrowski and Herzberg, 1976
Dabrowski, I.; Herzberg, G.,
The absorption and emission spectra of HD in the vacuum ultraviolet,
Can. J. Phys., 1976, 54, 525. [all data]
Dieke, 1936
Dieke, G.H.,
The 2s1Σ→2p1Σ bands of the hydrogen molecule,
Phys. Rev., 1936, 50, 797. [all data]
Durie and Herzberg, 1960
Durie, R.A.; Herzberg, G.,
Forbidden transitions in diatomic molecules. V. The rotation-vibration spectrum of the hydrogen-deuteride (HD) molecule,
Can. J. Phys., 1960, 38, 806. [all data]
McKellar, Goetz, et al., 1976
McKellar, A.R.W.; Goetz, W.; Ramsay, D.A.,
The rotation-vibration spectrum of HD: wavelength and intensity measurements of the 3-0, 4-0, 5-0, and 6-0 electric dipole bands,
Astrophys. J., 1976, 207, 663. [all data]
Trefler and Gush, 1968
Trefler, M.; Gush, H.P.,
Electric dipole moment of HD,
Phys. Rev. Lett., 1968, 20, 703. [all data]
Stoicheff, 1957
Stoicheff, B.P.,
High resolution Raman spectroscopy of gases. IX. Spectra of H2, HD, and D2,
Can. J. Phys., 1957, 35, 730. [all data]
Brannon, Church, et al., 1968
Brannon, P.J.; Church, C.H.; Peters, C.W.,
Electric field induced spectra of molecular hydrogen, deuterium and deuterium hydride,
J. Mol. Spectrosc., 1968, 27, 44. [all data]
Prasad and Reddy, 1975
Prasad, R.D.G.; Reddy, S.P.,
Infrared absorption spectra of gaseous HD. I. Collision-induced fundamental band of HD in the pure gas and HD-He mixtures at room temperature,
J. Chem. Phys., 1975, 62, 3582. [all data]
Kellogg, Rabi, et al., 1940
Kellogg, J.M.B.; Rabi, I.I.; Ramsey, N.F., Jr.; Zacharias, J.R.,
An electrical quadrupole moment of the deuteron. The radiofrequency spectra of HD and D2 molecules in a magnetic field,
Phys. Rev., 1940, 57, 677. [all data]
Ramsey, 1940
Ramsey, N.F., Jr.,
The rotational magnetic moments of H2, D2, and HD molecules. The rotational radiofrequency spectra of H2, D2, and HD in magnetic fields,
Phys. Rev., 1940, 58, 226. [all data]
Kolos and Wolniewicz, 1968
Kolos, W.; Wolniewicz, L.,
Vibrational and rotational energies of the B1Σu+, C1Πu, C1Πu, and a3Σg+ states of the hydrogen molecule,
J. Chem. Phys., 1968, 48, 3672. [all data]
Dalgarno and Wright, 1972
Dalgarno, A.; Wright, E.L.,
Infrared emissivities of H2 and HD,
Astrophys. J., 1972, 174, 49. [all data]
Itikawa, 1973
Itikawa, Y.,
Calculation of the cross sections for the photoionization of H2 and D2 into different vibrational states of the ion,
J. Electron Spectrosc. Relat. Phenom., 1973, 2, 125. [all data]
Ford, Docken, et al., 1975
Ford, A.L.; Docken, K.K.; Dalgarno, A.,
Cross sections for photoionization of vibrationally excited molecular hydrogen,
Astrophys. J., 1975, 200, 788. [all data]
Berkowitz and Spohr, 1973
Berkowitz, J.; Spohr, R.,
Comparison of photoelectron intensities and Franck-Condon factors in the photoionization of H2, HD and D2,
J. Electron Spectrosc. Relat. Phenom., 1973, 2, 143. [all data]
Dibeler, Reese, et al., 1965
Dibeler, V.H.; Reese, R.M.; Krauss, M.,
Massspectrometric study of photoionization. II. H2, HD, and D2,
J. Chem. Phys., 1965, 42, 2045. [all data]
Monfils, 1968, 2
Monfils, A.,
Calcul des fonctions potentielles de divers etats signulets excites des molecules H2, HD et D2,
Bull. Cl. Sci. Acad. R. Belg., 1968, 54, 44. [all data]
Geiger and Schmoranzer, 1969
Geiger, J.; Schmoranzer, H.,
Electronic and vibrational transition probabilities of isotopic hydrogen molecules H2, HD, and D2 based on electron energy loss spectra,
J. Mol. Spectrosc., 1969, 32, 39. [all data]
Herzberg, 1970
Herzberg, G.,
The dissociation energy of the hydrogen molecule,
J.Mol. Spectry., 1970, 33, 147. [all data]
Throson, 1971
Throson, W.R.,
Absorption edge doubling in the HD dissociation continuum,
J. Mol. Spectrosc., 1971, 37, 199. [all data]
Kolos and Wolniewicz, 1969
Kolos, W.; Wolniewicz, L.,
Theoretical investigation of the lowest double-minimum state E, F1Σg+ of the hydrogen molecule,
J. Chem. Phys., 1969, 50, 3228. [all data]
Takezawa, Innes, et al., 1967
Takezawa, S.; Innes, F.R.; Tanaka, Y.,
Selective enhancement in hydrogenlike molecules with the rare gases. II. HD and D2 with Ar and Kr,
J. Chem. Phys., 1967, 46, 4555. [all data]
Allison and Dalgarno, 1969
Allison, A.C.; Dalgarno, A.,
Photodissociation of vibrationally excited H2, HD, and D2 by absorption into the continua of the Lyman and Werner systems,
At. Data, 1969, 1, 91. [all data]
Fink, Akins, et al., 1969
Fink, E.H.; Akins, D.L.; Moore, C.B.,
Relative line intensities in the Lyman bands of HD,
Chem. Phys. Lett., 1969, 4, 283. [all data]
Allison, 1970
Allison, A.C.,
Note on the Lyman system of HD,
J. Chem. Phys., 1970, 52, 4909. [all data]
Becker and Fink, 1971
Becker, K.H.; Fink, E.H.,
Relative line intensities in the Lyman bands of HD and H2,
Z. Naturforsch. A, 1971, 26, 319. [all data]
LeRoy, 1971
LeRoy, R.J.,
Eigenvalues and certain expectation values for all bound and quasibound levels of ground-state (X1Σg+)H2, HD, and D2,
J. Chem. Phys., 1971, 54, 5433. [all data]
Karl, 1968
Karl, G.,
On the electric dipole moment of HD,
Can. J. Phys., 1968, 46, 1973. [all data]
Bunker, 1973
Bunker, P.R.,
Forbidden transitions in homopolar isotopically unsymmetric diatomic molecules and the dipole moment of HD,
J. Mol. Spectrosc., 1973, 46, 119. [all data]
Ramsey, 1956
Ramsey,
Molecular Beams, Clarendon Press, Oxford, 1956, 239. [all data]
Kolos and Wolniewicz, 1968, 2
Kolos, W.; Wolniewicz, L.,
Improved theoretical ground-state energy of the hydrogen molecule,
J. Chem. Phys., 1968, 49, 404. [all data]
Bunker, 1979
Bunker,
Unpublished cited in Huber and Herzberg, 1979, 1979, 261. [all data]
Herzberg and Jungen, 1972
Herzberg, G.; Jungen, Ch.,
Rydberg series and ionization potential of the H2 molecule,
J. Mol. Spectrosc., 1972, 41, 425. [all data]
McKellar, 1973
McKellar, A.R.W.,
Intensities and the Fano line shape in the infrared spectrum of HD,
Can. J. Phys., 1973, 51, 389. [all data]
Bejar and Gush, 1974
Bejar, J.; Gush, H.P.,
Fundamental absorption band of HD,
Can. J. Phys., 1974, 52, 1669. [all data]
McKellar, 1974
McKellar, A.R.W.,
Intensities of the dipole and quadrupole rotation-vibration spectra of HD,
Can. J. Phys., 1974, 52, 1144. [all data]
Bunker, 1976
Bunker, P.R.,
The rotational dependence of the intensities in the fundamental and overtone bands of HD,
J. Mol. Spectrosc., 1976, 61, 319. [all data]
Wolniewicz, 1975
Wolniewicz, L.,
On the computation of dipole transitions in the HD molecule,
Can. J. Phys., 1975, 53, 1207. [all data]
Huber and Herzberg, 1979
Huber, K.P.; Herzberg, G.,
Molecular Spectra and Molecular Structure. IV. Constants of Diatomic Molecules, Van Nostrand Reinhold Company, New York, 1979, 716. [all data]