Hexahydro-1,3,5-trinitroso-1,3,5-triazine
- Formula: C3H6N6O3
- Molecular weight: 174.1181
- IUPAC Standard InChIKey: HFWOSHMLDRSIDN-UHFFFAOYSA-N
- CAS Registry Number: 13980-04-6
- Chemical structure:
View 3d structure (requires JavaScript / HTML 5) - Other names: 1,3,5-Triazine, hexahydro-1,3,5-trinitroso-; s-Triazine, hexahydro-1,3,5-trinitroso-; Hexahydro-1,3,5-s-triazine; Hexahydro-1,3,5-trinitroso-s-triazine; 1,3,5-Trinitrosohexahydro-s-triazine; 1,3,5-Trinitroso-1,3,5-triazacyclohexane; Trinitrosotrimethylenetriamine; Trinitrosotrimethylentriamin; TTT; 1,3,5-Trinitroso-1,3,5-triazine, hexahydro-; N,N',N''-Trinitroso-1,3,5-hexahydrotriazine

Gas phase thermochemistry data

Data compiled by: Hussein Y. Afeefy, Joel F. Liebman, and Stephen E. Stein
Quantity | Value | Units | Method | Reference | Comment |
---|---|---|---|---|---|
ΔfH°gas | 395. | kJ/mol | Ccb | Pepekin, Matyushin, et al., 1974 |

Condensed phase thermochemistry data

Data compiled by: Hussein Y. Afeefy, Joel F. Liebman, and Stephen E. Stein
Quantity | Value | Units | Method | Reference | Comment |
---|---|---|---|---|---|
ΔfH°solid | 286. | kJ/mol | Ccb | Medard and Thomas, 1949 | Author's hf298_condensed=66.8 kcal/mol |
ΔfH°solid | 285.9 ± 2.3 | kJ/mol | Ccb | Delepine and Badoche, 1942 | Reanalyzed by Cox and Pilcher, 1970, Original value = 289. kJ/mol; Author's hf298_condensed=68.0 kcal/mol |
Quantity | Value | Units | Method | Reference | Comment |
ΔcH°solid | -2316. | kJ/mol | Ccb | Handrick, 1956 | |
ΔcH°solid | -2313.3 ± 2.1 | kJ/mol | Ccb | Young, Keith, et al., 1956 | Reanalyzed by Cox and Pilcher, 1970, Original value = -2323. ± 2. kJ/mol |
ΔcH°solid | -2323.9 | kJ/mol | Ccb | Medard and Thomas, 1949 | Author's hf298_condensed=66.8 kcal/mol |
ΔcH°solid | -2323.9 ± 2.3 | kJ/mol | Ccb | Delepine and Badoche, 1942 | Reanalyzed by Cox and Pilcher, 1970, Original value = -2327. kJ/mol; Author's hf298_condensed=68.0 kcal/mol |

Phase change data

Data compiled as indicated in comments:
TRC - Thermodynamics Research Center, NIST Boulder Laboratories, Chris Muzny director
AC - William E. Acree, Jr., James S. Chickos
ALS - Hussein Y. Afeefy, Joel F. Liebman, and Stephen E. Stein
CAL - James S. Chickos, William E. Acree, Jr., Joel F. Liebman, Students of Chem 202 (Introduction to the Literature of Chemistry), University of Missouri -- St. Louis
Quantity | Value | Units | Method | Reference | Comment |
---|---|---|---|---|---|
Tfus | 376. | K | N/A | Hall, 1971 | Crystal phase 1 phase; Uncertainty assigned by TRC = 1. K; TRC |
Quantity | Value | Units | Method | Reference | Comment |
ΔsubH° | 134.3 ± 0.7 | kJ/mol | ME | Cundall, Frank Palmer, et al., 1978 | Based on data from 343. to 447. K.; AC |
ΔsubH° | 113. | kJ/mol | V | Pepekin, Matyushin, et al., 1974 | ALS |
Enthalpy of sublimation
ΔsubH (kJ/mol) | Temperature (K) | Method | Reference | Comment |
---|---|---|---|---|
112.1 | 383. to 411. | ME | Pepekin, Matyushin, et al., 1974 | AC |
Enthalpy of fusion
ΔfusH (kJ/mol) | Temperature (K) | Reference | Comment |
---|---|---|---|
3.77 | 376. | Domalski and Hearing, 1996 | AC |
Entropy of fusion
ΔfusS (J/mol*K) | Temperature (K) | Reference | Comment |
---|---|---|---|
48.45 | 367. | Domalski and Hearing, 1996 | CAL |
10.02 | 376. |

References

Pepekin, Matyushin, et al., 1974
Pepekin, V.I.; Matyushin, Yu.N.; Lebedev, Yu.A.,
Thermochemistry of N-nitro- and N-nitrosoamines of the alicyclic series,
Bull. Acad. Sci. USSR, Div. Chem. Sci., 1974, 1707-1710. [all data]
Medard and Thomas, 1949
Medard, L.; Thomas, M.,
Determinations calorimetriques concernant dix-huit derives nitres ou nitrates organiques.,
Mem. Poudres, 1949, 29, 173-195. [all data]
Delepine and Badoche, 1942
Delepine, M.; Badoche, M.,
Thermochimie de l'aldehyde formique, de l'hexamethylene-tetramine et de ses derive,
C. R. Acad. Sci. Paris, 1942, 214, 777-780. [all data]
Cox and Pilcher, 1970
Cox, J.D.; Pilcher, G.,
Thermochemistry of Organic and Organometallic Compounds, Academic Press, New York, 1970, 1-636. [all data]
Handrick, 1956
Handrick, G.R.,
Report of the study of pure explosive compounds. Part IV. Calculation of heat of combustion of organic compounds from structural features and calculation of power of high explosives, Rpt. C-58247 for the Office of the Chief of Ordnance, contract DA-19-020-ORD-47 by the Arthur D. Little, Inc., Cambridge, MA, 1956, 467-573. [all data]
Young, Keith, et al., 1956
Young, J.A.; Keith, J.E.; Stehle, P.; Dzombak, W.C.; Hunt, H.,
Heats of combustion of some organic nitrogen compounds,
Ind. Eng. Chem., 1956, 48, 1375-1378. [all data]
Hall, 1971
Hall, P.G.,
Thermal decomposition and phase transition in solid nitramines,
Trans. Faraday Soc., 1971, 67, 556-62. [all data]
Cundall, Frank Palmer, et al., 1978
Cundall, Robert B.; Frank Palmer, T.; Wood, Colin E.C.,
Vapour pressure measurements on some organic high explosives,
J. Chem. Soc., Faraday Trans. 1, 1978, 74, 0, 1339, https://doi.org/10.1039/f19787401339
. [all data]
Domalski and Hearing, 1996
Domalski, Eugene S.; Hearing, Elizabeth D.,
Heat Capacities and Entropies of Organic Compounds in the Condensed Phase. Volume III,
J. Phys. Chem. Ref. Data, 1996, 25, 1, 1, https://doi.org/10.1063/1.555985
. [all data]