Fluoroimidogen
- Formula: FN
- Molecular weight: 33.0051
- IUPAC Standard InChIKey: CMUBZTZNXGBJMQ-UHFFFAOYSA-N
- CAS Registry Number: 13967-06-1
- Chemical structure:
View 3d structure (requires JavaScript / HTML 5) - Permanent link for this species. Use this link for bookmarking this species for future reference.

Gas phase thermochemistry data

Quantity | Value | Units | Method | Reference | Comment |
---|---|---|---|---|---|
ΔfH°gas | 248.95 | kJ/mol | Review | Chase, 1998 | Data last reviewed in June, 1965 |
Quantity | Value | Units | Method | Reference | Comment |
S°gas,1 bar | 215.28 | J/mol*K | Review | Chase, 1998 | Data last reviewed in June, 1965 |
Gas Phase Heat Capacity (Shomate Equation)
Cp° = A + B*t + C*t2 + D*t3 +
E/t2
H° − H°298.15= A*t + B*t2/2 +
C*t3/3 + D*t4/4 − E/t + F − H
S° = A*ln(t) + B*t + C*t2/2 + D*t3/3 −
E/(2*t2) + G
Cp = heat capacity (J/mol*K)
H° = standard enthalpy (kJ/mol)
S° = standard entropy (J/mol*K)
t = temperature (K) / 1000.
View plot Requires a JavaScript / HTML 5 canvas capable browser.
Temperature (K) | 298. to 1000. | 1000. to 6000. |
---|---|---|
A | 19.91714 | 37.09401 |
B | 40.74187 | 0.624278 |
C | -36.46059 | -0.038341 |
D | 11.98959 | 0.002707 |
E | 0.106823 | -1.399909 |
F | 241.8553 | 234.0864 |
G | 229.3464 | 254.4951 |
H | 248.9484 | 248.9484 |
Reference | Chase, 1998 | Chase, 1998 |
Comment | Data last reviewed in June, 1965 | Data last reviewed in June, 1965 |

Gas phase ion energetics data

Data compiled as indicated in comments:
LL - Sharon G. Lias and Joel F. Liebman
LBLHLM - Sharon G. Lias, John E. Bartmess, Joel F. Liebman, John L. Holmes, Rhoda D. Levin, and W. Gary Mallard
B - John E. Bartmess
Electron affinity determinations
EA (eV) | Method | Reference | Comment |
---|---|---|---|
0.499990 | EIAE | Sidirov, 1982 | value altered from reference due to conversion from electron convention to ion convention; B |
Ionization energy determinations
IE (eV) | Method | Reference | Comment |
---|---|---|---|
12.1 ± 0.4 | EI | Tarnovsky, Levin, et al., 1994 | LL |
12.26 ± 0.01 | PE | Dyke, Jonathan, et al., 1982 | LBLHLM |
12.63 ± 0.01 | PE | Dyke, Jonathan, et al., 1982 | Vertical value; LBLHLM |

Constants of diatomic molecules

Data compiled by: Klaus P. Huber and Gerhard H. Herzberg

Data collected through May, 1977

Symbols used in the table of constants
SymbolMeaning
State electronic state and / or symmetry symbol
Te minimum electronic energy (cm-1)
ωe vibrational constant – first term (cm-1)
ωexe vibrational constant – second term (cm-1)
ωeye vibrational constant – third term (cm-1)
Be rotational constant in equilibrium position (cm-1)
αe rotational constant – first term (cm-1)
γe rotation-vibration interaction constant (cm-1)
De centrifugal distortion constant (cm-1)
βe rotational constant – first term, centrifugal force (cm-1)
re internuclear distance (Å)
Trans. observed transition(s) corresponding to electronic state
ν00 position of 0-0 band (units noted in table)
Diatomic constants for 14N19F
StateTeωeωexeωeyeBeαeγeDeβereTrans.ν00
Theoretical potential functions and spectroscopic constants for the ground and several excited states O'Hare and Wahl, 1971, Andersen and Ohrn, 1973, Ellis and Banyard, 1974
b 1Σ+ 18877.05 1197.49 Z 8.64  1.23770 0.01448  5.28E-6  1.29983 b 1 → X 2 V 18905.20 Z
missing citation
a 1Δ [12003.60]    [1.2225] 3   [4.5E-6]  [1.3079] a → X V 11435.16 Z
missing citation
X 3Σ- 0 1141.37 Z 8.99  1.20568 4 0.01492  5.39E-6  1.31698 5
Milligan and Jacox, 1964

References

Chase, 1998
Chase, M.W., Jr.,
NIST-JANAF Themochemical Tables, Fourth Edition,
J. Phys. Chem. Ref. Data, Monograph 9, 1998, 1-1951. [all data]