Difluorosilylene
- Formula: F2Si
- Molecular weight: 66.0823
- IUPAC Standard InChIKey: MGNHOGAVECORPT-UHFFFAOYSA-N
- CAS Registry Number: 13966-66-0
- Chemical structure:
View 3d structure (requires JavaScript / HTML 5) - Permanent link for this species. Use this link for bookmarking this species for future reference.

Gas phase thermochemistry data

Quantity | Value | Units | Method | Reference | Comment |
---|---|---|---|---|---|
ΔfH°gas | -587.85 | kJ/mol | Review | Chase, 1998 | Data last reviewed in December, 1977 |
Quantity | Value | Units | Method | Reference | Comment |
S°gas,1 bar | 256.58 | J/mol*K | Review | Chase, 1998 | Data last reviewed in December, 1977 |
Gas Phase Heat Capacity (Shomate Equation)
Cp° = A + B*t + C*t2 + D*t3 +
E/t2
H° − H°298.15= A*t + B*t2/2 +
C*t3/3 + D*t4/4 − E/t + F − H
S° = A*ln(t) + B*t + C*t2/2 + D*t3/3 −
E/(2*t2) + G
Cp = heat capacity (J/mol*K)
H° = standard enthalpy (kJ/mol)
S° = standard entropy (J/mol*K)
t = temperature (K) / 1000.
View plot Requires a JavaScript / HTML 5 canvas capable browser.
Temperature (K) | 298. to 1000. | 1000. to 6000. |
---|---|---|
A | 31.80677 | 57.64632 |
B | 67.03354 | 0.580982 |
C | -65.39215 | -0.239494 |
D | 22.79765 | 0.034826 |
E | -0.185259 | -1.985761 |
F | -600.4040 | -610.8473 |
G | 276.7444 | 317.3074 |
H | -587.8520 | -587.8520 |
Reference | Chase, 1998 | Chase, 1998 |
Comment | Data last reviewed in December, 1977 | Data last reviewed in December, 1977 |

Gas phase ion energetics data

Data compiled as indicated in comments:
LLK - Sharon G. Lias, Rhoda D. Levin, and Sherif A. Kafafi
RDSH - Henry M. Rosenstock, Keith Draxl, Bruce W. Steiner, and John T. Herron
B - John E. Bartmess
Electron affinity determinations
EA (eV) | Method | Reference | Comment |
---|---|---|---|
0.10 ± 0.10 | LPES | Kawamata, Neigishi, et al., 1996 | Vertical Detachment Energy: 0.68±0.02 eV; B |
Ionization energy determinations
IE (eV) | Method | Reference | Comment |
---|---|---|---|
10.78 ± 0.05 | PE | Westwood, 1974 | LLK |
11.3 ± 0.1 | EI | McDonald, Williams, et al., 1968 | RDSH |
11.08 | PE | Fehlner and Turner, 1974 | Vertical value; LLK |

References

Chase, 1998
Chase, M.W., Jr.,
NIST-JANAF Themochemical Tables, Fourth Edition,
J. Phys. Chem. Ref. Data, Monograph 9, 1998, 1-1951. [all data]