Clorosilylidyne
- Formula: ClSi
- Molecular weight: 63.538
- IUPAC Standard InChIKey: SLLGVCUQYRMELA-UHFFFAOYSA-N
- CAS Registry Number: 13966-57-9
- Chemical structure:
View 3d structure (requires JavaScript / HTML 5) - Permanent link for this species. Use this link for bookmarking this species for future reference.

Gas phase thermochemistry data

Quantity | Value | Units | Method | Reference | Comment |
---|---|---|---|---|---|
ΔfH°gas | 198.32 | kJ/mol | Review | Chase, 1998 | Data last reviewed in December, 1976 |
Quantity | Value | Units | Method | Reference | Comment |
S°gas,1 bar | 237.81 | J/mol*K | Review | Chase, 1998 | Data last reviewed in December, 1976 |
Gas Phase Heat Capacity (Shomate Equation)
Cp° = A + B*t + C*t2 + D*t3 +
E/t2
H° − H°298.15= A*t + B*t2/2 +
C*t3/3 + D*t4/4 − E/t + F − H
S° = A*ln(t) + B*t + C*t2/2 + D*t3/3 −
E/(2*t2) + G
Cp = heat capacity (J/mol*K)
H° = standard enthalpy (kJ/mol)
S° = standard entropy (J/mol*K)
t = temperature (K) / 1000.
View plot Requires a JavaScript / HTML 5 canvas capable browser.
Temperature (K) | 298. to 6000. |
---|---|
A | 37.05618 |
B | 0.803018 |
C | -0.174955 |
D | 0.026525 |
E | -0.135609 |
F | 186.7796 |
G | 281.6623 |
H | 198.3224 |
Reference | Chase, 1998 |
Comment | Data last reviewed in December, 1976 |

References

Chase, 1998
Chase, M.W., Jr.,
NIST-JANAF Themochemical Tables, Fourth Edition,
J. Phys. Chem. Ref. Data, Monograph 9, 1998, 1-1951. [all data]