HPt

Reaction thermochemistry data

Data compiled by: John E. Bartmess

Individual Reactions

Pt- + Hydrogen cation = HPt

By formula: Pt- + H+ = HPt

Quantity Value Units Method Reference Comment
Δr1443.0kJ/molD-EABilodeau, Scheer, et al., 1999gas phase

References

Bilodeau, Scheer, et al., 1999
Bilodeau, R.C.; Scheer, M.; Haugen, H.K.; Brooks, R.L., Near-threshold Laser Spectroscopy of Iridium and Platinum Negative Ions: Electron Affinities and the Threshold Law, Phys. Rev. A, 1999, 61, 1, 12505, https://doi.org/10.1103/PhysRevA.61.012505 . [all data]