Manganese, acetylpentacarbonyl-, (OC-6-21)-
- Formula: C7H3MnO6
- Molecular weight: 238.0332
- IUPAC Standard InChIKey: HSHGZSOJMSYWAG-UHFFFAOYSA-N
- CAS Registry Number: 13963-91-2
- Chemical structure:
View 3d structure (requires JavaScript / HTML 5) - Other names: Manganese, acetylpentacarbonyl-; Acetylpentacarbonylmanganese

Gas phase thermochemistry data

Data compiled by: José A. Martinho Simões
Quantity | Value | Units | Method | Reference | Comment |
---|---|---|---|---|---|
ΔfH°gas | -900.7 ± 8.2 | kJ/mol | Review | Martinho Simões | The enthalpy formation relies on -750.9 ± 4.1 kJ/mol for the enthalpy of formation of Mn(CO)5(Me)(g) |
ΔfH°gas | -889.7 ± 8.9 | kJ/mol | Review | Martinho Simões | |
ΔfH°gas | -895. ± 9. | kJ/mol | Review | Martinho Simões | Selected data. Average of the values from Connor, Zafarani-Moattar, et al., 1982 |

Condensed phase thermochemistry data

Data compiled by: José A. Martinho Simões
Quantity | Value | Units | Method | Reference | Comment |
---|---|---|---|---|---|
ΔfH°solid | -980.7 ± 4.2 | kJ/mol | Review | Martinho Simões | The enthalpy formation relies on -750.9 ± 4.1 kJ/mol for the enthalpy of formation of Mn(CO)5(Me)(g) |
ΔfH°solid | -969.7 ± 5.5 | kJ/mol | Review | Martinho Simões | |
ΔfH°solid | -975. ± 6. | kJ/mol | Review | Martinho Simões | Selected data. Average of the values from Connor, Zafarani-Moattar, et al., 1982 |

Phase change data

Data compiled as indicated in comments:
MS - José A. Martinho Simões
AC - William E. Acree, Jr., James S. Chickos
Quantity | Value | Units | Method | Reference | Comment |
---|---|---|---|---|---|
ΔsubH° | 80. ± 7. | kJ/mol | TD-HFC | Connor, Zafarani-Moattar, et al., 1982 | MS |
ΔsubH° | 80. ± 7. | kJ/mol | C | Connor, Zafarani-Moattar, et al., 1982, 2 | AC |

Reaction thermochemistry data

Data compiled by: José A. Martinho Simões
Individual Reactions
(solution) +
(solution) =
(solution)
By formula: C6H3MnO5 (solution) + CO (solution) = C7H3MnO6 (solution)
Quantity | Value | Units | Method | Reference | Comment |
---|---|---|---|---|---|
ΔrH° | -56.1 ± 4.2 | kJ/mol | RSC | Nolan, López de la Vega, et al., 1986 | solvent: Tetrahydrofuran |
ΔrH° | -52.7 | kJ/mol | EqS | Calderazzo, 1977 | solvent: 2,2'-diethoxydiethyl ether |
(cr) + 1.5
(g) =
(cr) + 6
(g) +
(g)
By formula: C7H3MnO6 (cr) + 1.5Br2 (g) = Br2Mn (cr) + 6CO (g) + CH3Br (g)
Quantity | Value | Units | Method | Reference | Comment |
---|---|---|---|---|---|
ΔrH° | -161. ± 5. | kJ/mol | HAL-HFC | Connor, Zafarani-Moattar, et al., 1982 |
By formula: C7H3MnO6 (cr) = C6H3MnO5 (g) + CO (g)
Quantity | Value | Units | Method | Reference | Comment |
---|---|---|---|---|---|
ΔrH° | 119.3 ± 0.9 | kJ/mol | TD-HFC | Connor, Zafarani-Moattar, et al., 1982 |

References

Martinho Simões
Martinho Simões, J.A.,
Private communication (see http://webbook.nist.gov/chemistry/om/). [all data]
Connor, Zafarani-Moattar, et al., 1982
Connor, J.A.; Zafarani-Moattar, M.T.; Bickerton, J.; El-Saied, N.I.; Suradi, S.; Carson, R.; Al Takkhin, G.; Skinner, H.A.,
Organomet., 1982, 1, 1166. [all data]
Connor, Zafarani-Moattar, et al., 1982, 2
Connor, Joseph A.; Zafarani-Moattar, Mohamed T.; Bickerton, James; El Saied, Nabila I.; Suradi, Sukiman; Carson, Ronald; Al Takhin, Ghassan; Skinner, Henry A.,
Enthalpy of formation of acyl-, alkyl- and hydridopentacarbonyl-manganese complexes. The enthalpy contributions of manganese-hydrogen and manganese-carbon bonds in these molecules. Thermochemical aspects of models in Fischer-Tropsch reactions,
Organometallics, 1982, 1, 9, 1166-1174, https://doi.org/10.1021/om00069a011
. [all data]
Nolan, López de la Vega, et al., 1986
Nolan, S.P.; López de la Vega, R.; Hoff, C.D.,
J. Am. Chem. Soc., 1986, 108, 7852. [all data]
Calderazzo, 1977
Calderazzo, F.,
Angew. Chem. Int. Ed. Engl., 1977, 16, 299. [all data]