R,R,R-4,8,12-trimethyl-1,5,9-trioxacyclododeca-2,6,10-trione
- Formula: C12H18O6
- Molecular weight: 258.2677
- CAS Registry Number: 139629-08-6

Phase change data

Data compiled by: William E. Acree, Jr., James S. Chickos
Enthalpy of fusion
ΔfusH (kcal/mol) | Temperature (K) | Reference |
---|---|---|
5.141 | 380.2 | Lebedev, Bykova, et al., 1996 |

References

Lebedev, Bykova, et al., 1996
Lebedev, B.V.; Bykova, T.A.; Kiparisova, E.G.; Vasil'yev, V.G.,
Thermodynamics of depolymerization of biotechnological poly[(R)-3-hydroxbutyrate] with formation of (R,R,R)-4,8,12-trimethyl-1,5,9-trioxadodeca-2,6,10-trione and of its polymerization with ring-opening to highly isotactic poly[(R)-3-hydroxybutyrate] from 0 to 500 K at standard pressure,
Macromol. Chem. Phys., 1996, 197, 1553-1576. [all data]