Benzenamine, 4-phenoxy-
- Formula: C12H11NO
- Molecular weight: 185.2218
- IUPAC Standard InChIKey: WOYZXEVUWXQVNV-UHFFFAOYSA-N
- CAS Registry Number: 139-59-3
- Chemical structure:
View 3d structure (requires JavaScript / HTML 5) - Other names: Aniline, p-phenoxy-; p-Aminophenyl phenyl ether; p-Phenoxyaniline; 4-Amino-1-phenoxybenzene; 4-Aminodiphenyl ether; 4-Aminophenyl phenyl ether; 4-Phenoxyaniline; 4-Phenoxaniline; Ether, 4-aminophenyl phenyl; 4-Aminodifenylether; 4-Aminobiphenyl ether; 4-(Phenyloxy)aniline; 4-Phenoxybenzenamine; NSC 4629

Phase change data

Data compiled by: Robert L. Brown and Stephen E. Stein
Quantity | Value | Units | Method | Reference | Comment |
---|---|---|---|---|---|
Tfus | 356. to 357. | K | N/A | Buckingham and Donaghy, 1982 |
Reduced pressure boiling point
Tboil (K) | Pressure (bar) | Reference |
---|---|---|
461.2 | 0.019 | Weast and Grasselli, 1989 |
460. to 462. | 0.019 | Buckingham and Donaghy, 1982 |

References

Buckingham and Donaghy, 1982
Buckingham, J.; Donaghy, S.M.,
Dictionary of Organic Compounds: Fifth Edition, Chapman and Hall, New York, 1982, 1. [all data]
Weast and Grasselli, 1989
CRC Handbook of Data on Organic Compounds, 2nd Editon, Weast,R.C and Grasselli, J.G., ed(s)., CRC Press, Inc., Boca Raton, FL, 1989, 1. [all data]