HIn
- Formula: HIn
- Molecular weight: 115.826
- CAS Registry Number: 13939-13-4

Reaction thermochemistry data

Data compiled by: John E. Bartmess
Individual Reactions
In- + = HIn
Quantity | Value | Units | Method | Reference | Comment |
---|---|---|---|---|---|
ΔrH° | 1519. ± 8.8 | kJ/mol | D-EA | Walter, Gibson, et al., 2010 | gas phase; Given: 383.92±0.06 meV |
Quantity | Value | Units | Method | Reference | Comment |
ΔrG° | 1498. ± 9.2 | kJ/mol | H-TS | Walter, Gibson, et al., 2010 | gas phase; Given: 383.92±0.06 meV |

Constants of diatomic molecules

Data compiled by: Klaus P. Huber and Gerhard H. Herzberg
Data collected through January, 1977
Symbol | Meaning |
---|---|
State | electronic state and / or symmetry symbol |
Te | minimum electronic energy (cm-1) |
ωe | vibrational constant – first term (cm-1) |
ωexe | vibrational constant – second term (cm-1) |
ωeye | vibrational constant – third term (cm-1) |
Be | rotational constant in equilibrium position (cm-1) |
αe | rotational constant – first term (cm-1) |
γe | rotation-vibration interaction constant (cm-1) |
De | centrifugal distortion constant (cm-1) |
βe | rotational constant – first term, centrifugal force (cm-1) |
re | internuclear distance (Å) |
Trans. | observed transition(s) corresponding to electronic state |
ν00 | position of 0-0 band (units noted in table) |
State | Te | ωe | ωexe | ωeye | Be | αe | γe | De | βe | re | Trans. | ν00 |
---|---|---|---|---|---|---|---|---|---|---|---|---|
Open band structure in absorption from 40000 to 42900 cm-1, no prominent heads. | ||||||||||||
↳Garton, 1951 | ||||||||||||
A 1Π | (22655) | [141.7] Z | 1 | [3.850] 2 | 3 | 389E-5 | [2.093] | A ← X R | 22016.9 Z | |||
↳Neuhaus, 1958; Neuhaus, 1958, 2 | ||||||||||||
a 3Π2 | (17800) | [1300.9] 4 Z | 5.489 4 5 | 0.332 | [34.6E-5] | 1.753 | a → X VR | 17780.9 Z | ||||
↳Ginter, 1963 | ||||||||||||
a 3Π1 | 16941.61 | 1415.11 4 Z | 43.55 6 | 5.3996 4 7 8 9 10 | 0.2356 7 | [32.1E-5] 7 | 1.7678 | a ↔ X RV | 16904.98 Z | |||
↳Grundstrom, 1939; Neuhaus, 1958; Ginter, 1963 | ||||||||||||
State | Te | ωe | ωexe | ωeye | Be | αe | γe | De | βe | re | Trans. | ν00 |
a 3Π0+ | 16278.15 | 1458.57 4 Z | 61.03 11 | 5.329 4 8 10 | 0.2468 12 | [27.7E-5] 13 | 1.7794 | a ↔ X RV | 16259.68 Z | |||
↳Grundstrom, 1939; Ginter, 1963 | ||||||||||||
a 3Π0- | (16230) | [1303.42] 4 Z | 5.349 4 | 0.326 | [28.1E-5] 14 | 1.776 | a → X VR | 16211.53 Z | ||||
↳Ginter, 1966 | ||||||||||||
a' 3Σ+ | Not observed, but suggested Veseth and Lofthus, 1974 as the state responsible for anomalies in the Λ-type doubling of 3Π1 and for the predissociation of all 3Π components. | |||||||||||
X 1Σ+ | 0 | 1476.04 Z | 25.61 15 | 4.9945 10 | 0.1428 16 | 22.3E-5 17 | 1.8380 |

References

Walter, Gibson, et al., 2010
Walter, C.W.; Gibson, N.D.; Carman, D.J.; Li, Y.G.; Matyas, D.J.,
Electron affinity of indium and the fine structure of In- measured using infrared photodetachment threshold spectroscopy,
Phys. Rev. A, 2010, 82, 3, 032507, https://doi.org/10.1103/PhysRevA.82.032507
. [all data]
Garton, 1951
Garton, W.R.S.,
Extension of line series in the arc spectrum of indium: ultra-violet absorption bands probably due to InH and GaH,
Proc. Phys. Soc. London Sect. A, 1951, 64, 509. [all data]
Neuhaus, 1958
Neuhaus, H.,
Die hyperfeinstruktur der Indiumhydrid-Banden,
Z. Phys., 1958, 150, 4-9. [all data]
Neuhaus, 1958, 2
Neuhaus, H.,
Uber die Indiumdeutrid- und -hydridbanden und deren Hyperfeinstruktur,
Z. Phys., 1958, 152, 402-416. [all data]
Ginter, 1963
Ginter, M.L.,
The band spectrum of the InH molecule: characterization of the a3Π state,
J. Mol. Spectrosc., 1963, 11, 301-320. [all data]
Grundstrom, 1939
Grundstrom, B.,
Das Bandenspektrum des Indiumhydrids,
Z. Phys., 1939, 113, 721-729. [all data]
Ginter, 1966
Ginter, M.L.,
Identification of the a 3Π0-(0-) → X1 Σ+ (0+) transition of the InH molecule,
J. Mol. Spectrosc., 1966, 20, 240-247. [all data]
Veseth and Lofthus, 1974
Veseth, L.; Lofthus, A.,
Rotational Energies of Hund's case (c) 3Π states in diatomic molecules. The a3Π state of InH and InD,
J. Mol. Spectrosc., 1974, 49, 414-422. [all data]
Larsson and Neuhaus, 1964
Larsson, T.; Neuhaus, H.,
Magnetic effects in the spectrum of indium hydride and their relevance for the coupling problem,
Ark. Fys., 1964, 27, 19, 275-287. [all data]
Ginter and Battino, 1965
Ginter, M.L.; Battino, R.,
On the calculation of potential curves by the Rydberg-Klein-Rees method. I. Experimental limitations, extrapolation procedures, and applications to the third-group hydrides,
J. Chem. Phys., 1965, 42, 3222. [all data]
Larsson, Neuhaus, et al., 1968
Larsson, T.; Neuhaus, H.; Aslund, N.,
Precision measurements of the hyperfine splittings in the optical spectrum of indium hydride,
Ark. Fys., 1968, 37, 13, 141-149. [all data]
Freed, 1966
Freed, K.F.,
On the hyperfine structure of InH and the theory of the hyperfine structure of molecules in Hund's case (C),
J. Chem. Phys., 1966, 45, 5, 1714-1722. [all data]
Veseth, 1976
Veseth, L.,
The hyperfine structure of diatomic molecules: Hund's case (cα),
J. Mol. Spectrosc., 1976, 59, 51. [all data]