CAS Reg. No. 13937-35-4
- CAS Registry Number: 13937-35-4

Reaction thermochemistry data

Data compiled by: John E. Bartmess
Individual Reactions
(CAS Reg. No. 13937-35-4 • 4294967295) +
= CAS Reg. No. 13937-35-4
By formula: (CAS Reg. No. 13937-35-4 • 4294967295HAs) + HAs = CAS Reg. No. 13937-35-4
Quantity | Value | Units | Method | Reference | Comment |
---|---|---|---|---|---|
ΔrH° | 363. ± 10. | kJ/mol | N/A | Gal, Maria, et al., 1989 | gas phase |

References

Gal, Maria, et al., 1989
Gal, J.-F.; Maria, P.-C.; Decouzon, M.,
The Gas-Phase Acidity and Bond Dissociation Energies of Hydrogen Telluride,
Int. J. Mass Spectrom. Ion Proc., 1989, 93, 1, 87, https://doi.org/10.1016/0168-1176(89)83076-9
. [all data]