2-Isobutyl-3-methylpyrazine
- Formula: C9H14N2
- Molecular weight: 150.2209
- IUPAC Standard InChIKey: ZHMIODDNZRIENW-UHFFFAOYSA-N
- CAS Registry Number: 13925-06-9
- Chemical structure:
View 3d structure (requires JavaScript / HTML 5) - Other names: Pyrazine, 2-methyl-3-(2-methylpropyl)-; 2-Methyl-3-(2-methylpropyl)pyrazine; 3-Methyl-2-isobutyl pyrazine

Van Den Dool and Kratz RI, non-polar column, temperature ramp

Column type | Active phase | I | Reference | Comment |
---|---|---|---|---|
Capillary | DB-5 | 1114. | Dob, Dahmane, et al., 2006 | 30. m/0.32 mm/0.25 μm, N2, 60. C @ 3. min, 3. K/min, 240. C @ 5. min |

Normal alkane RI, non-polar column, temperature ramp

Column type | Active phase | I | Reference | Comment |
---|---|---|---|---|
Capillary | SLB-5MS | 1144. | Risticevic, Carasek, et al., 2008 | 10. m/0.18 mm/0.18 μm, Helium, 40. C @ 1.5 min, 10. K/min; Tend: 295. C |

Normal alkane RI, non-polar column, custom temperature program

Column type | Active phase | I | Reference | Comment |
---|---|---|---|---|
Capillary | SLB-5MS | 1134. | Risticevic, Carasek, et al., 2008 | 10. m/0.18 mm/0.18 μm, Helium; Program: not specified |

Normal alkane RI, polar column, temperature ramp

Column type | Active phase | I | Reference | Comment |
---|---|---|---|---|
Capillary | FFAP | 1490. | Vernin, Metzger, et al., 1988 | He, 60. C @ 5. min, 2. K/min; Column length: 50. m; Column diameter: 0.28 mm; Tend: 240. C |

References

Dob, Dahmane, et al., 2006
Dob, T.; Dahmane, D.; Chelghoum, C.,
Essential oil composition of Juniperus oxycedrus growing in Algeria,
Pharm. Biol., 2006, 44, 1, 1-6, https://doi.org/10.1080/13880200500530922
. [all data]
Risticevic, Carasek, et al., 2008
Risticevic, S.; Carasek, E.; Pawliszyn, J.,
Headspace solid-phase microextraction-gas chromatographic-time-of-flight mass spectrometric methodology for geographical origin verification of coffee,
Anal. Chim. Acta, 2008, 617, 1-2, 72-84, https://doi.org/10.1016/j.aca.2008.04.009
. [all data]
Vernin, Metzger, et al., 1988
Vernin, G.; Metzger, J.; Obretenov, T.; Suon, K.-N.; Fraisse, D.,
GC/MS (EI,PCI,SIM)-data bank analysis of volatile compounds arising from thermal degradation of glucose-valine amadori intermediates
in Flavors and Fragrances: A World Perspective. Proceedings of the 10th International Congress of Essential Oils, Fragrances and Flavors, Lawrence,B.M.; Mookherjee,B.D.; Willis,B.J., ed(s)., Elsevier, New York, 1988, 999-1028. [all data]