Cyclohexanol, 1-methyl-4-(1-methylethenyl)-
- Formula: C10H18O
- Molecular weight: 154.2493
- IUPAC Standard InChIKey: RUJPNZNXGCHGID-UHFFFAOYSA-N
- CAS Registry Number: 138-87-4
- Chemical structure:
- Stereoisomers:
- Other names: p-Menth-8-en-1-ol; β-Terpineol; t-Menth-1-en-8-ol; β-Terpinol; 1-methyl-4-(1-Methylethenyl)-cyclohexanol; p-Ment-8-en-1-ol; 1-methyl-4-(1-methylvinyl)cyclohexan-1-ol

Phase change data

Data compiled by: Robert L. Brown and Stephen E. Stein
Reduced pressure boiling point
Tboil (K) | Pressure (bar) | Reference |
---|---|---|
363.2 | 0.013 | Weast and Grasselli, 1989 |

Normal alkane RI, non-polar column, temperature ramp

Data compiled by: NIST Mass Spectrometry Data Center, William E. Wallace, director

Column type CapillaryCapillaryCapillaryCapillaryCapillary
Active phase DB-5 MSCP Sil 5 CBHP-5PE-5RSL-200
Column length (m) 60.30.30.30.30.
Carrier gas HeliumN2HeH2H2
Substrate
Column diameter (mm) 0.250.320.250.320.32
Phase thickness (μm) 0.250.250.250.250.25
Tstart (C) 40.60.60.60.40.
Tend (C) 330.300.250.230.280.
Heat rate (K/min) 2.4.10.5.6.
Initial hold (min) 12. 2.2.5.
Final hold (min) 30. 10.4.5.
I 1153.1133.1153.1155.1135.
ReferencePatil, Jayaprakasha, et al., 2009Baran, von Reuss, et al., 2007Wang, Yang, et al., 2006Singh, Raina, et al., 2005Jirovetz, Buchbauer, et al., 2003
Comment MSDC-RI MSDC-RI MSDC-RI MSDC-RI MSDC-RI
Column type CapillaryCapillaryCapillaryCapillaryCapillary
Active phase DB-1OV-101OV-101DB-1OV-101
Column length (m) 60.50.50.50.25.
Carrier gas HeNitrogenN2HeNitrogen
Substrate
Column diameter (mm) 0.320.250.20.250.20
Phase thickness (μm) 0.25  0.25
Tstart (C) 50.40.80.70.60.
Tend (C) 200.200.200.240.220.
Heat rate (K/min) 3.2.1.4.4.
Initial hold (min) 6.10.  0.
Final hold (min)   20. 0.
I 1134.1124.1134.1129.1132.
ReferenceCimanga, Apers, et al., 2002Tamura, Boonbumrung, et al., 2000Menon, Chacko, et al., 1999Palá-Paúl, Pérez-Alonso, et al., 1999Tropnikova, Zenkevich, et al., 1999
Comment MSDC-RI MSDC-RI MSDC-RI MSDC-RI MSDC-RI
Column type CapillaryCapillaryCapillaryCapillaryCapillary
Active phase Methyl SiliconeMethyl SiliconeOV-101OV-101OV-101
Column length (m) 50.50.50.50.50.
Carrier gas N2N2NitrogenNitrogenN2
Substrate
Column diameter (mm) 0.250.250.250.250.25
Phase thickness (μm) 0.170.17
Tstart (C) 80.80.70.80.80.
Tend (C) 200.200.200.200.200.
Heat rate (K/min) 2.3.2.2.2.
Initial hold (min)
Final hold (min)
I 1156.1154.1136.1137.1132.
ReferenceGopalakrishnan, Menon, et al., 1993Gopalakrishnan, Menon, et al., 1993Sugisawa, Nakamura, et al., 1990Sugisawa, Nakamura, et al., 1990Yang and Sugisawa, 1990
Comment MSDC-RI MSDC-RI MSDC-RI MSDC-RI MSDC-RI
Column type CapillaryCapillaryCapillaryCapillaryCapillary
Active phase OV-101OV-101OV-101OV-101DB-1
Column length (m) 50.50.50.50.50.
Carrier gas N2N2N2N2
Substrate
Column diameter (mm) 0.250.250.250.250.32
Phase thickness (μm)
Tstart (C) 80.80.80.80.0.
Tend (C) 200.200.200.200.250.
Heat rate (K/min) 2.2.2.2.3.
Initial hold (min)
Final hold (min)
I 1135.1137.1132.1135.1160.
ReferenceYang and Sugisawa, 1990Sugisawa, Yamamoto, et al., 1989Sugisawa, Yang, et al., 1989Sugisawa, Yang, et al., 1989Habu, Flath, et al., 1985
Comment MSDC-RI MSDC-RI MSDC-RI MSDC-RI MSDC-RI
Column type CapillaryCapillaryCapillary
Active phase DB-1SE-30+IgepalSE-30+Igepal
Column length (m) 50.100.100.
Carrier gas
Substrate
Column diameter (mm) 0.320.250.25
Phase thickness (μm)
Tstart (C) 50.70.70.
Tend (C) 250.170.170.
Heat rate (K/min) 3.1.1.
Initial hold (min)
Final hold (min)
I 1157.1123.1157.
ReferenceHabu, Flath, et al., 1985Shibamoto and Jennings, 1977Shibamoto and Jennings, 1977
Comment MSDC-RI MSDC-RI MSDC-RI

Normal alkane RI, non-polar column, custom temperature program

Data compiled by: NIST Mass Spectrometry Data Center, William E. Wallace, director

Column type CapillaryCapillaryCapillaryCapillaryCapillary
Active phase DB-5CB-1CB-1HP-5HP-5
Column length (m) 60.30.30.30.30.
Carrier gas HeliumHeliumHeliumHeliumHelium
Substrate
Column diameter (mm) 0.250.250.250.250.25
Phase thickness (μm) 1.000.250.250.250.25
Program 40 0C 4 0C/min -> 230 0C 100 0C/min -> 260 0C (11.7 min)40 0C (2 min) 4 0C/min -> 180 0C 20 0C/min -> 220 0C (1 min)not specified40 0C (3 min) 3 0C/min -> 160 0C (2 min) 8 0C/min -> 220 0C (3 min)not specified
I 1162.1122.1137.1149.1159.
ReferenceMiyazaki, Plotto, et al., 2011Kannaste, Vongvanich, et al., 2008Kannaste, Vongvanich, et al., 2008Qiao, Xie, et al., 2008Qiao, Xie, et al., 2008
Comment MSDC-RI MSDC-RI MSDC-RI MSDC-RI MSDC-RI
Column type CapillaryCapillaryCapillaryCapillaryCapillary
Active phase HP-5HP-5CP-Sil5 CB MSCP Sil 8 CBDB-5
Column length (m) 30.30.50.50.
Carrier gas    He
Substrate
Column diameter (mm) 0.250.250.320.32
Phase thickness (μm) 0.250.251.2
Program 40 0C (2 min) 5 0C/min -> 80 0C 7 oC/min -> 160 0C 9 0C/min -> 200 0C 20 0C/min -> 280 0C (10 min)not specified36C(2min) => 20C/min => 85C => 1C/min => 145C => 3C/min => 250C(30min)50 0C (2 min) 3 0C/min -> 180 0C (1 min) 20 0C/min -> 250 0C (2 min)not specified
I 1147.1143.1143.1187.1144.
ReferenceZhao, Li, et al., 2008Zhao, Li, et al., 2008Iraqi, Vermeulen, et al., 2005Mockutë, Bernotienë, et al., 2004Isidorov, Zenkevich, et al., 1997
Comment MSDC-RI MSDC-RI MSDC-RI MSDC-RI MSDC-RI
Column type CapillaryCapillaryCapillaryCapillary
Active phase Polydimethyl siloxanesPolydimethyl siloxanesOV-101OV-1, SE-30, Methyl silicone, SP-2100, OV-101, DB-1, etc.
Column length (m)    50.
Carrier gas    Hydrogen
Substrate
Column diameter (mm)    0.32
Phase thickness (μm)
Program not specifiednot specifiednot specifiednot specified
I 1132.1154.1137.1156.
ReferenceZenkevich, 1997Zenkevich, 1997Shibamoto, 1987Waggott and Davies, 1984
Comment MSDC-RI MSDC-RI MSDC-RI MSDC-RI

References

Weast and Grasselli, 1989
CRC Handbook of Data on Organic Compounds, 2nd Editon, Weast,R.C and Grasselli, J.G., ed(s)., CRC Press, Inc., Boca Raton, FL, 1989, 1. [all data]