samarium dichloride
- CAS Registry Number: 13874-75-4

Reaction thermochemistry data

Data compiled by: John E. Bartmess
Individual Reactions
Cl4Sm- + samarium dichloride = Cl6Sm2-
By formula: Cl4Sm- + samarium dichloride = Cl6Sm2-
Quantity | Value | Units | Method | Reference | Comment |
---|---|---|---|---|---|
ΔrH° | 55.0 ± 2.2 | kcal/mol | TDEq | Khasanshin, Pogrebnoi, et al., 1998 | gas phase; Analyzed as SmCl2..SmCl4-; value altered from reference due to conversion from electron convention to ion convention |
+ samarium dichloride = Cl3Sm-
By formula: Cl- + samarium dichloride = Cl3Sm-
Quantity | Value | Units | Method | Reference | Comment |
---|---|---|---|---|---|
ΔrH° | 61.50 ± 0.50 | kcal/mol | TDEq | Khasanshin, Pogrebnoi, et al., 1998 | gas phase; value altered from reference due to conversion from electron convention to ion convention |

Ion clustering data

Data compiled by: John E. Bartmess
Clustering reactions
+ samarium dichloride = Cl3Sm-
By formula: Cl- + samarium dichloride = Cl3Sm-
Quantity | Value | Units | Method | Reference | Comment |
---|---|---|---|---|---|
ΔrH° | 61.50 ± 0.50 | kcal/mol | TDEq | Khasanshin, Pogrebnoi, et al., 1998 | gas phase; value altered from reference due to conversion from electron convention to ion convention |
Cl4Sm- + samarium dichloride = Cl6Sm2-
By formula: Cl4Sm- + samarium dichloride = Cl6Sm2-
Quantity | Value | Units | Method | Reference | Comment |
---|---|---|---|---|---|
ΔrH° | 55.0 ± 2.2 | kcal/mol | TDEq | Khasanshin, Pogrebnoi, et al., 1998 | gas phase; Analyzed as SmCl2..SmCl4-; value altered from reference due to conversion from electron convention to ion convention |

References

Khasanshin, Pogrebnoi, et al., 1998
Khasanshin, I.V.; Pogrebnoi, A.M.; Kudin, L.S.; Kuznetsov, A.Y.; Butman, M.F.,
The Neutral and Ionic Components of Saturated Vapor of Samarium Dichloride: The Thermochemical Characteristics of Gaseous Molecules and Ions,
High Temp., 1998, 36, 687-694. [all data]