Lithium tetrafluoroberyllate

Condensed phase thermochemistry data

Quantity Value Units Method Reference Comment
Δfliquid-2241.07kJ/molReviewChase, 1998Data last reviewed in December, 1971
Quantity Value Units Method Reference Comment
liquid,1 bar171.41J/mol*KReviewChase, 1998Data last reviewed in December, 1971
Quantity Value Units Method Reference Comment
Δfsolid-2273.59kJ/molReviewChase, 1998Data last reviewed in December, 1971
Quantity Value Units Method Reference Comment
solid130.58J/mol*KReviewChase, 1998Data last reviewed in December, 1971

Liquid Phase Heat Capacity (Shomate Equation)

Cp° = A + B*t + C*t2 + D*t3 + E/t2
H° − H°298.15= A*t + B*t2/2 + C*t3/3 + D*t4/4 − E/t + F − H
S° = A*ln(t) + B*t + C*t2/2 + D*t3/3 − E/(2*t2) + G
    Cp = heat capacity (J/mol*K)
    H° = standard enthalpy (kJ/mol)
    S° = standard entropy (J/mol*K)
    t = temperature (K) / 1000.

View plot Requires a JavaScript / HTML 5 canvas capable browser.

View table.

Temperature (K) 732.2 - 2500.
A 232.0865
B -6.185376×10-8
C 3.597135×10-8
D -6.826741×10-9
E -3.532552×10-9
F -2326.773
G 409.3098
H -2241.072
ReferenceChase, 1998
Comment Data last reviewed in December, 1971

Solid Phase Heat Capacity (Shomate Equation)

Cp° = A + B*t + C*t2 + D*t3 + E/t2
H° − H°298.15= A*t + B*t2/2 + C*t3/3 + D*t4/4 − E/t + F − H
S° = A*ln(t) + B*t + C*t2/2 + D*t3/3 − E/(2*t2) + G
    Cp = heat capacity (J/mol*K)
    H° = standard enthalpy (kJ/mol)
    S° = standard entropy (J/mol*K)
    t = temperature (K) / 1000.

View plot Requires a JavaScript / HTML 5 canvas capable browser.

View table.

Temperature (K) 298. - 732.2
A 90.68234
B 149.4646
C -0.348170
D 0.109802
E 0.003692
F -2307.254
G 195.7940
H -2273.590
ReferenceChase, 1998
Comment Data last reviewed in December, 1971

References

Chase, 1998
Chase, M.W., Jr., NIST-JANAF Themochemical Tables, Fourth Edition, J. Phys. Chem. Ref. Data, Monograph 9, 1998, 1-1951. [all data]