(4-Nitrophenyl)-6-chlorohexyl carbamate

Phase change data

Data compiled by: William E. Acree, Jr., James S. Chickos

Enthalpy of fusion

ΔfusH (kJ/mol) Temperature (K) Method Reference
30.31360.8DSCTiers and Francis, 1993

References

Tiers and Francis, 1993
Tiers, George V.D.; Francis, Cecil V., Materials science of organic compounds, Thermochimica Acta, 1993, 226, 311-316, https://doi.org/10.1016/0040-6031(93)80232-Y . [all data]