Dihydrogen trisulfide
- Formula: H2S3
- Molecular weight: 98.211
- IUPAC Standard InChIKey: KBMBVTRWEAAZEY-UHFFFAOYSA-N
- CAS Registry Number: 13845-23-3
- Chemical structure:
View 3d structure (requires JavaScript / HTML 5) - Permanent link for this species. Use this link for bookmarking this species for future reference.

Phase change data

Data compiled by: William E. Acree, Jr., James S. Chickos
Enthalpy of vaporization
ΔvapH (kJ/mol) | Temperature (K) | Method | Reference | Comment |
---|---|---|---|---|
43.1 | 343. | N/A | Dykyj, Svoboda, et al., 1999 | Based on data from 328. to 474. K. |
45.5 ± 0.2 | 293. | C | Feh«65533»r and Hitzemann, 1958 |

References

Dykyj, Svoboda, et al., 1999
Dykyj, J.; Svoboda, J.; Wilhoit, R.C.; Frenkel, M.L.; Hall, K.R.,
Vapor Pressure of Chemicals: Part A. Vapor Pressure and Antoine Constants for Hydrocarbons and Sulfur, Selenium, Tellurium and Hydrogen Containing Organic Compounds, Springer, Berlin, 1999, 373. [all data]
Feh«65533»r and Hitzemann, 1958
Feh«65533»r, F.; Hitzemann, G.,
Beitr«65533»ge zur Chemie des Schwefels. 44. Verdampfungsenthalpien, Dampfdrucke, Siedepunkte, kritische Temperaturen und Drucke sowie Troutonsche Konstanten von Sulfanen,
Z. Anorg. Allg. Chem., 1958, 294, 1-2, 50-62, https://doi.org/10.1002/zaac.19582940105
. [all data]