Difluoroboryl radical
- Formula: BF2
- Molecular weight: 48.808
- IUPAC Standard InChIKey: OKZIUSOJQLYFSE-UHFFFAOYSA-N
- CAS Registry Number: 13842-55-2
- Chemical structure:
View 3d structure (requires JavaScript / HTML 5) - Permanent link for this species. Use this link for bookmarking this species for future reference.

Gas phase thermochemistry data

Quantity | Value | Units | Method | Reference | Comment |
---|---|---|---|---|---|
ΔfH°gas | -589.94 | kJ/mol | Review | Chase, 1998 | Data last reviewed in June, 1972 |
Quantity | Value | Units | Method | Reference | Comment |
S°gas,1 bar | 247.16 | J/mol*K | Review | Chase, 1998 | Data last reviewed in June, 1972 |
Gas Phase Heat Capacity (Shomate Equation)
Cp° = A + B*t + C*t2 + D*t3 +
E/t2
H° − H°298.15= A*t + B*t2/2 +
C*t3/3 + D*t4/4 − E/t + F − H
S° = A*ln(t) + B*t + C*t2/2 + D*t3/3 −
E/(2*t2) + G
Cp = heat capacity (J/mol*K)
H° = standard enthalpy (kJ/mol)
S° = standard entropy (J/mol*K)
t = temperature (K) / 1000.
View plot Requires a JavaScript / HTML 5 canvas capable browser.
Temperature (K) | 298. to 800. | 800. to 6000. |
---|---|---|
A | 15.77058 | 58.68227 |
B | 103.6745 | -0.908660 |
C | -101.7390 | 0.331009 |
D | 37.05405 | -0.020317 |
E | 0.172057 | -3.472193 |
F | -597.8518 | -616.9015 |
G | 240.4934 | 304.5442 |
H | -589.9440 | -589.9440 |
Reference | Chase, 1998 | Chase, 1998 |
Comment | Data last reviewed in June, 1972 | Data last reviewed in June, 1972 |

Gas phase ion energetics data

Data compiled as indicated in comments:
LL - Sharon G. Lias and Joel F. Liebman
LBLHLM - Sharon G. Lias, John E. Bartmess, Joel F. Liebman, John L. Holmes, Rhoda D. Levin, and W. Gary Mallard
LLK - Sharon G. Lias, Rhoda D. Levin, and Sherif A. Kafafi
B - John E. Bartmess
Electron affinity determinations
EA (eV) | Method | Reference | Comment |
---|---|---|---|
2.13 ± 0.13 | IMRE | Srivastava, Uy, et al., 1974 | EA: 29.2 kcal < EA(F), new EA(F) used. Too stable by ca. 24 kcal/mol, relative to G3(MP2)B3 calcs.; B |
Ionization energy determinations
IE (eV) | Method | Reference | Comment |
---|---|---|---|
9.4 | DER | Lias, Bartmess, et al., 1988 | LL |
9.0 ± 1.0 | EI | Farber and Srivastava, 1984 | LBLHLM |
9. ± 1. | EI | Uy, Srivastava, et al., 1971 | LLK |
8. ± 1. | EI | Srivastava and Farber, 1971 | LLK |

References

Chase, 1998
Chase, M.W., Jr.,
NIST-JANAF Themochemical Tables, Fourth Edition,
J. Phys. Chem. Ref. Data, Monograph 9, 1998, 1-1951. [all data]