Iodosilylidyne
- Formula: ISi
- Molecular weight: 154.9900
- IUPAC Standard InChIKey: BEADMLIDEVGQBP-UHFFFAOYSA-N
- CAS Registry Number: 13841-19-5
- Chemical structure:
View 3d structure (requires JavaScript / HTML 5) - Information on this page:

Gas phase thermochemistry data

Quantity | Value | Units | Method | Reference | Comment |
---|---|---|---|---|---|
ΔfH°gas | 313.63 | kJ/mol | Review | Chase, 1998 | Data last reviewed in December, 1976 |
Quantity | Value | Units | Method | Reference | Comment |
S°gas,1 bar | 253.85 | J/mol*K | Review | Chase, 1998 | Data last reviewed in December, 1976 |
Gas Phase Heat Capacity (Shomate Equation)
Cp° = A + B*t + C*t2 + D*t3 +
E/t2
H° − H°298.15= A*t + B*t2/2 +
C*t3/3 + D*t4/4 − E/t + F − H
S° = A*ln(t) + B*t + C*t2/2 + D*t3/3 −
E/(2*t2) + G
Cp = heat capacity (J/mol*K)
H° = standard enthalpy (kJ/mol)
S° = standard entropy (J/mol*K)
t = temperature (K) / 1000.
View plot Requires a JavaScript / HTML 5 canvas capable browser.
Temperature (K) | 298. to 1200. | 1200. to 6000. |
---|---|---|
A | 48.90217 | 39.76691 |
B | -19.02582 | -0.555238 |
C | 12.94843 | -0.047700 |
D | -3.085237 | 0.064392 |
E | -0.468319 | -0.206919 |
F | 298.2150 | 301.9459 |
G | 315.5217 | 302.6530 |
H | 313.6293 | 313.6293 |
Reference | Chase, 1998 | Chase, 1998 |
Comment | Data last reviewed in December, 1976 | Data last reviewed in December, 1976 |

Constants of diatomic molecules

Data compiled by: Klaus P. Huber and Gerhard H. Herzberg
Data collected through September, 1977
Symbol | Meaning |
---|---|
State | electronic state and / or symmetry symbol |
Te | minimum electronic energy (cm-1) |
ωe | vibrational constant – first term (cm-1) |
ωexe | vibrational constant – second term (cm-1) |
ωeye | vibrational constant – third term (cm-1) |
Be | rotational constant in equilibrium position (cm-1) |
αe | rotational constant – first term (cm-1) |
γe | rotation-vibration interaction constant (cm-1) |
De | centrifugal distortion constant (cm-1) |
βe | rotational constant – first term, centrifugal force (cm-1) |
re | internuclear distance (Å) |
Trans. | observed transition(s) corresponding to electronic state |
ν00 | position of 0-0 band (units noted in table) |
State | Te | ωe | ωexe | ωeye | Be | αe | γe | De | βe | re | Trans. | ν00 |
---|---|---|---|---|---|---|---|---|---|---|---|---|
Unassigned bands in the region 41500 - 43600 cm-1. | ||||||||||||
↳Olddershaw and Robinson, 1972 | ||||||||||||
F | F ← X1 V | 44995 H | ||||||||||
↳missing citation | ||||||||||||
(E) 1 | (E ← X) | (44104) | ||||||||||
↳missing citation | ||||||||||||
D | D ← X1 V | 42859 H | ||||||||||
↳missing citation | ||||||||||||
State | Te | ωe | ωexe | ωeye | Be | αe | γe | De | βe | re | Trans. | ν00 |
C | 42711 | 486 H | 3.5 | C ← X1 V | 42772 H | |||||||
↳missing citation | ||||||||||||
B 2Σ | 32380.3 | 471.7 H | 0.9 | B ← X1 V | 32434.3 H | |||||||
↳Oldershaw and Robinson, 1968; missing citation | ||||||||||||
A 2Σ | 21204.9 | 208.6 H | 1.66 2 | 0.079 | 3 | A ← X1 R | 21127.2 H | |||||
↳missing citation | ||||||||||||
a (4Σ1/2-) | x + 20289.7 | 275.7 H | 5.6 | [(0.118)] 4 | [(2.50)] | a ↔ X2 5 R | 20246.9 H | |||||
↳missing citation; missing citation | ||||||||||||
State | Te | ωe | ωexe | ωeye | Be | αe | γe | De | βe | re | Trans. | ν00 |
X2 2Π3/2 | x 6 | 359.0 H | 1.1 | |||||||||
X1 2Π1/2 | 0 | 363.8 H | [(1.25)] 7 | [(2.45)] |

References

Chase, 1998
Chase, M.W., Jr.,
NIST-JANAF Themochemical Tables, Fourth Edition,
J. Phys. Chem. Ref. Data, Monograph 9, 1998, 1-1951. [all data]
Olddershaw and Robinson, 1972
Olddershaw, G.A.; Robinson, K.,
Ultraviolet spectra of GeI and SiI: lower wavelength bands,
J. Mol. Spectrosc., 1972, 44, 602. [all data]
Oldershaw and Robinson, 1968
Oldershaw, G.A.; Robinson, K.,
Ultra-violet absorption spectra of GeI and SiI,
Trans. Faraday Soc., 1968, 64, 2256. [all data]
Billingsley, 1972
Billingsley, J.,
The absorption and emission spectrum of silicon monoiodide,
J. Mol. Spectrosc., 1972, 43, 3, 128-147. [all data]
Lakshminarayana and Haranath, 1970
Lakshminarayana, A.; Haranath, P.B.V.,
The emission band spectrum of silicon monoiodide,
J. Phys. B:, 1970, 3, 4, 576-579. [all data]