3-Cyclohexene-1-ethanol, β,4-dimethyl-, [S-(R*,S*)]-
- Formula: C10H18O
- Molecular weight: 154.2493
- IUPAC Standard InChIKey: ZTYHGIAOVUPAAH-UWVGGRQHSA-N
- CAS Registry Number: 13835-75-1
- Chemical structure:
View 3d structure (requires JavaScript / HTML 5) - Stereoisomers:
- Other names: p-Menth-1-en-9-ol, (4R,8S)-(+)-; (+)-p-Menta-1-en-9-ol; 3-Cyclohexene-1-ethanol, β,4-dimethyl-, [S-(R,S)]-; 2-(4-Methyl-3-cyclohexen-1-yl)-1-propanol-, (βS,1R)-; (+)-p-Mentha-1-en-9-ol; menthen-9-ol; p-menth-1-ene-9-ol

Van Den Dool and Kratz RI, non-polar column, temperature ramp

Column type | Active phase | I | Reference | Comment |
---|---|---|---|---|
Capillary | HP-5 | 1288. | Song, Sawamura, et al., 2000 | 30. m/0.25 mm/0.25 μm, He, 2. K/min; Tstart: 70. C; Tend: 230. C |

Van Den Dool and Kratz RI, polar column, custom temperature program

Column type | Active phase | I | Reference | Comment |
---|---|---|---|---|
Packed | DB-Wax | 1924. | Rouseff, Smoot, et al., 2002 | Program: not specified |

References

Song, Sawamura, et al., 2000
Song, H.S.; Sawamura, M.; Ito, T.; Kawashimo, K.; Ukeda, H.,
Quantitative determination of characteric flavour of Citrus junos (yuzu) peel oil,
Flavour Fragr. J., 2000, 15, 4, 245-250, https://doi.org/10.1002/1099-1026(200007/08)15:4<245::AID-FFJ904>3.0.CO;2-V
. [all data]
Rouseff, Smoot, et al., 2002
Rouseff, R.; Smoot, J.; Valim, F.; Dreher, G.; Mahattanatawee, k.; Bell, W.; Blaze, M.,
Flavor Database, 2002, retrieved from http://www.lal.ufl.edu/rouseff. [all data]