3-Cyclohexene-1-ethanol, β,4-dimethyl-, [R-(R*,R*)]-
- Formula: C10H18O
- Molecular weight: 154.2493
- IUPAC Standard InChIKey: ZTYHGIAOVUPAAH-NXEZZACHSA-N
- CAS Registry Number: 13835-30-8
- Chemical structure:
View 3d structure (requires JavaScript / HTML 5) - Stereoisomers:
- Other names: p-Menth-1-en-9-ol, (4R,8R)-(+)-

Phase change data

Data compiled by: Robert L. Brown and Stephen E. Stein
Reduced pressure boiling point
Tboil (K) | Pressure (bar) | Reference |
---|---|---|
388.7 | 0.013 | Aldrich Chemical Company Inc., 1990 |

References

Aldrich Chemical Company Inc., 1990
Aldrich Chemical Company Inc.,
Catalog Handbook of Fine Chemicals, Aldrich Chemical Company, Inc., Milwaukee WI, 1990, 1. [all data]