Acetic acid, (acetyloxy)-
- Formula: C4H6O4
- Molecular weight: 118.0880
- IUPAC Standard InChIKey: MLXDUYUQINCFFV-UHFFFAOYSA-N
- CAS Registry Number: 13831-30-6
- Chemical structure:
View 3d structure (requires JavaScript / HTML 5) - Other names: Glycolic acid, acetate; (Acetyloxy)acetic acid; α-Acetoxyacetic acid; 2-Hydroxyacetic acid acetata; Acetoxyacetic acid; Acetylglycolic acid; O-Acetylglycolic acid; Acetic acid, 2-(acetyloxy)-; 2-Acetoxyacetic acid

Phase change data

Data compiled by: Robert L. Brown and Stephen E. Stein
Quantity | Value | Units | Method | Reference | Comment |
---|---|---|---|---|---|
Tfus | 339. to 341. | K | N/A | Buckingham and Donaghy, 1982 |
Reduced pressure boiling point
Tboil (K) | Pressure (bar) | Reference |
---|---|---|
414.7 | 0.016 | Aldrich Chemical Company Inc., 1990 |
417.7 | 0.016 | Weast and Grasselli, 1989 |
418. | 0.016 | Buckingham and Donaghy, 1982 |

Van Den Dool and Kratz RI, non-polar column, custom temperature program

Column type | Active phase | I | Reference | Comment |
---|---|---|---|---|
Capillary | HP-5MS | 1019.8 | Andriamaharavo, 2014 | 30. m/0.25 mm/0.25 μm, He; Program: 60C (1 min) => 5 C/min => 210C => 10 C/min => 280C (15 min) |

References

Buckingham and Donaghy, 1982
Buckingham, J.; Donaghy, S.M.,
Dictionary of Organic Compounds: Fifth Edition, Chapman and Hall, New York, 1982, 1. [all data]
Aldrich Chemical Company Inc., 1990
Aldrich Chemical Company Inc.,
Catalog Handbook of Fine Chemicals, Aldrich Chemical Company, Inc., Milwaukee WI, 1990, 1. [all data]
Weast and Grasselli, 1989
CRC Handbook of Data on Organic Compounds, 2nd Editon, Weast,R.C and Grasselli, J.G., ed(s)., CRC Press, Inc., Boca Raton, FL, 1989, 1. [all data]
Andriamaharavo, 2014
Andriamaharavo, N.R.,
Retention Data. NIST Mass Spectrometry Data Center., NIST Mass Spectrometry Data Center, 2014. [all data]