perfluorododecyl hexylene methacrylate

Phase change data

Data compiled by: Thermodynamics Research Center, NIST Boulder Laboratories, Chris Muzny director

Quantity Value Units Method Reference Comment
Tfus363.KN/AHopken, Faulstich, et al., 1992Uncertainty assigned by TRC = 0.1 K

In addition to the Thermodynamics Research Center (TRC) data available from this site, much more physical and chemical property data is available from the following TRC products:

References

Hopken, Faulstich, et al., 1992
Hopken, J.; Faulstich, S.; Moller, M., Mol. Cryst. Liq. Cryst. Sci. Technol., Sect. A, 1992, 59. [all data]