Difluorosilane

Gas phase thermochemistry data

Quantity Value Units Method Reference Comment
Δfgas-189.00kcal/molReviewChase, 1998Data last reviewed in June, 1976
Quantity Value Units Method Reference Comment
gas,1 bar62.648cal/mol*KReviewChase, 1998Data last reviewed in June, 1976

Gas Phase Heat Capacity (Shomate Equation)

Cp° = A + B*t + C*t2 + D*t3 + E/t2
H° − H°298.15= A*t + B*t2/2 + C*t3/3 + D*t4/4 − E/t + F − H
S° = A*ln(t) + B*t + C*t2/2 + D*t3/3 − E/(2*t2) + G
    Cp = heat capacity (cal/mol*K)
    H° = standard enthalpy (kcal/mol)
    S° = standard entropy (cal/mol*K)
    t = temperature (K) / 1000.

View plot Requires a JavaScript / HTML 5 canvas capable browser.

View table.

Temperature (K) 298. - 1200.1200. - 6000.
A 5.90789024.52849
B 34.373400.692661
C -24.77170-0.134875
D 6.7404590.009070
E -0.104087-3.093421
F -192.4340-203.7210
G 60.0050982.12729
H -189.0000-189.0000
ReferenceChase, 1998Chase, 1998
Comment Data last reviewed in June, 1976 Data last reviewed in June, 1976

Phase change data

Data compiled as indicated in comments:
AC - William E. Acree, Jr., James S. Chickos

Enthalpy of vaporization

ΔvapH (kcal/mol) Temperature (K) Reference Comment
4.76159.Emel«65533»us and Maddock, 1944Based on data from 151. - 167. K.; AC

Antoine Equation Parameters

log10(P) = A − (B / (T + C))
    P = vapor pressure (atm)
    T = temperature (K)

View plot Requires a JavaScript / HTML 5 canvas capable browser.

Temperature (K) A B C Reference Comment
126.5 - 195.33.97626657.142-30.551Stull, 1947Coefficents calculated by NIST from author's data.

References

Chase, 1998
Chase, M.W., Jr., NIST-JANAF Themochemical Tables, Fourth Edition, J. Phys. Chem. Ref. Data, Monograph 9, 1998, 1-1951. [all data]