CAS Reg. No. 13822-53-2

Reaction thermochemistry data

Data compiled by: John E. Bartmess

Individual Reactions

(CAS Reg. No. 13822-53-2 • 4294967295Styrene) + Styrene = CAS Reg. No. 13822-53-2

By formula: (CAS Reg. No. 13822-53-2 • 4294967295C8H8) + C8H8 = CAS Reg. No. 13822-53-2

Quantity Value Units Method Reference Comment
Δr205. ± 9.2kJ/molN/ABartmess, Scott, et al., 1979gas phase; value altered from reference due to change in acidity scale

References

Bartmess, Scott, et al., 1979
Bartmess, J.E.; Scott, J.A.; McIver, R.T., Jr., The gas phase acidity scale from methanol to phenol, J. Am. Chem. Soc., 1979, 101, 6047. [all data]