Pentane, 1,1,1-trimethoxy-
- Formula: C8H18O3
- Molecular weight: 162.2267
- IUPAC Standard InChIKey: XUXVVQKJULMMKX-UHFFFAOYSA-N
- CAS Registry Number: 13820-09-2
- Chemical structure:
View 3d structure (requires JavaScript / HTML 5) - Other names: Orthovaleric acid, trimethyl ester; Trimethyl orthovalerate; 1,1,1-Trimethoxypentane; ortho-n-Valeric acid trimethyl ester

Phase change data

Data compiled by: Robert L. Brown and Stephen E. Stein
Quantity | Value | Units | Method | Reference | Comment |
---|---|---|---|---|---|
Tboil | 438.2 | K | N/A | Aldrich Chemical Company Inc., 1990 |

Reaction thermochemistry data

Data compiled by: Hussein Y. Afeefy, Joel F. Liebman, and Stephen E. Stein
Individual Reactions
By formula: C8H18O3 + H2O = C6H12O2 + 2CH4O
Quantity | Value | Units | Method | Reference | Comment |
---|---|---|---|---|---|
ΔrH° | -25.53 ± 0.050 | kJ/mol | Cm | Wiberg, Martin, et al., 1985 | liquid phase; solvent: Aqueous dioxane |
ΔrH° | -25.72 ± 0.03 | kJ/mol | Cm | Wiberg, 1980 | liquid phase; solvent: Water; Hydrolysis |

References

Aldrich Chemical Company Inc., 1990
Aldrich Chemical Company Inc.,
Catalog Handbook of Fine Chemicals, Aldrich Chemical Company, Inc., Milwaukee WI, 1990, 1. [all data]
Wiberg, Martin, et al., 1985
Wiberg, K.B.; Martin, E.J.; Squires, R.R.,
Thermochemical studies of carbonyl compounds. 3. Enthalpies of hydrolysis of ortho esters,
J. Org. Chem., 1985, 50, 4717-4720. [all data]
Wiberg, 1980
Wiberg, K.B.,
Energies of organic compounds,
Rept. DOE-E(11-1)4060 Prepared for US Dept. of Energy by Yale Univ., New Haven, CT. Avail. NTIS, 1980, 1-24. [all data]