Aluminum chloride fluoride
- Formula: AlClF2
- Molecular weight: 100.431
- IUPAC Standard InChIKey: AAYWCFPMITZDSH-UHFFFAOYSA-K
- CAS Registry Number: 13814-65-8
- Chemical structure:

Gas phase thermochemistry data

Quantity | Value | Units | Method | Reference | Comment |
---|---|---|---|---|---|
ΔfH°gas | -238.80 | kcal/mol | Review | Chase, 1998 | Data last reviewed in June, 1976 |
Quantity | Value | Units | Method | Reference | Comment |
S°gas,1 bar | 71.152 | cal/mol*K | Review | Chase, 1998 | Data last reviewed in June, 1976 |
Gas Phase Heat Capacity (Shomate Equation)
Cp° = A + B*t + C*t2 + D*t3 +
E/t2
H° − H°298.15= A*t + B*t2/2 +
C*t3/3 + D*t4/4 − E/t + F − H
S° = A*ln(t) + B*t + C*t2/2 + D*t3/3 −
E/(2*t2) + G
Cp = heat capacity (cal/mol*K)
H° = standard enthalpy (kcal/mol)
S° = standard entropy (cal/mol*K)
t = temperature (K) / 1000.
View plot Requires a JavaScript / HTML 5 canvas capable browser.
Temperature (K) | 298. to 6000. |
---|---|
A | 18.81110 |
B | 0.888561 |
C | -0.238243 |
D | 0.020197 |
E | -0.316512 |
F | -245.5069 |
G | 91.88191 |
H | -238.8000 |
Reference | Chase, 1998 |
Comment | Data last reviewed in June, 1976 |

Reaction thermochemistry data

Data compiled by: John E. Bartmess
Individual Reactions
By formula: Cl- + AlClF2 = (Cl- • AlClF2)
Quantity | Value | Units | Method | Reference | Comment |
---|---|---|---|---|---|
ΔrH° | 74.3 ± 2.9 | kcal/mol | TDAs | Pervova, Korobov, et al., 1992 | gas phase; Thermo at 0K, experiments at 800-1100K. See also AlCl2F..F-; value altered from reference due to conversion from electron convention to ion convention |
By formula: F- + AlClF2 = (F- • AlClF2)
Quantity | Value | Units | Method | Reference | Comment |
---|---|---|---|---|---|
ΔrH° | 117.4 ± 2.9 | kcal/mol | TDAs | Pervova, Korobov, et al., 1992 | gas phase; Thermo at 0K, experiments at 800-1100 K; value altered from reference due to conversion from electron convention to ion convention |

Ion clustering data

Data compiled by: John E. Bartmess
Clustering reactions
By formula: Cl- + AlClF2 = (Cl- • AlClF2)
Quantity | Value | Units | Method | Reference | Comment |
---|---|---|---|---|---|
ΔrH° | 74.3 ± 2.9 | kcal/mol | TDAs | Pervova, Korobov, et al., 1992 | gas phase; Thermo at 0K, experiments at 800-1100K. See also AlCl2F..F-; value altered from reference due to conversion from electron convention to ion convention |
By formula: F- + AlClF2 = (F- • AlClF2)
Quantity | Value | Units | Method | Reference | Comment |
---|---|---|---|---|---|
ΔrH° | 117.4 ± 2.9 | kcal/mol | TDAs | Pervova, Korobov, et al., 1992 | gas phase; Thermo at 0K, experiments at 800-1100 K; value altered from reference due to conversion from electron convention to ion convention |

References

Chase, 1998
Chase, M.W., Jr.,
NIST-JANAF Themochemical Tables, Fourth Edition,
J. Phys. Chem. Ref. Data, Monograph 9, 1998, 1-1951. [all data]
Pervova, Korobov, et al., 1992
Pervova, Y.U.; Korobov, M.V.; Sidorov, L.N.,
Enthalpies of Bonds Rupture in AlClnF4-n(-) Anions,
Russ. J. Phys. Chem., 1992, 66, 635. [all data]