1,2-butanediol diacetate
- Formula: C8H14O4
- Molecular weight: 174.1944
- IUPAC Standard InChIKey: KPTMSNPLDZKSST-UHFFFAOYSA-N
- CAS Registry Number: 13814-27-2
- Chemical structure:
View 3d structure (requires JavaScript / HTML 5) - Permanent link for this species. Use this link for bookmarking this species for future reference.

Phase change data

Data compiled by: Thermodynamics Research Center, NIST Boulder Laboratories, Chris Muzny director
Quantity | Value | Units | Method | Reference | Comment |
---|---|---|---|---|---|
Tboil | 475.65 | K | N/A | Henninger, 1886 | Uncertainty assigned by TRC = 3. K |

References

Henninger, 1886
Henninger, A.,
Several Derivatives of Erythritol and Formates of Polyatomic Alcohols,
Ann. Chim. Phys., 1886, [6] 7, 209. [all data]