4-Chloroacetamidobenzophenone
- Formula: C15H12ClNO2
- Molecular weight: 273.714
- IUPAC Standard InChIKey: NHAUKYAYIYDFST-UHFFFAOYSA-N
- CAS Registry Number: 13788-59-5
- Chemical structure:
View 3d structure (requires JavaScript / HTML 5) - Other names: Benzophenone, 2-acetamino-5-chloro-; N-(2-Benzoyl-4-chlorophenyl)acetamide; 2-Amino-5-chlorobenzophenone, acetylated; Nordazepam + M (oxazepam), hydrolysis, acetylated; Diazepam M (nor-) + M (oxazepam), hydrolysis, acetylated; Halazepam M (desalkyl-), hydrolysis, acetylated; Medazepam M (nordazepam), hydrolysis, acetylated; Diazepam, M(oxa/epam), acid hydrolyzed, acetylated; Ketazolam M (oxazepam), hydrolysis, acetylated; Prazepam M (desalkyl-), hydrolysis, acetylated; Oxazepam, hydrolysis, acetylated; Clorazepate, hydrolysis, acetylated; Chlordiazepoxide, hydrolysis, acetylated; Oxazolam + M (nordazepam), hydrolysis, acetylated; Temazepam M (nor-), hydrolysis, acetylated; Camazepam M (oxazepam), hydrolysis, acetylated; 2-Amino-5-chlorobenzophenone, N-acetyl-

Kovats' RI, non-polar column, temperature ramp

Column type | Active phase | I | Reference | Comment |
---|---|---|---|---|
Packed | OV-101 | 2245. | Maurer, 1990 | N2, Chromosorb G HP, 100. C @ 3. min, 30. K/min, 310. C @ 5. min; Column length: 0.6 m |
Capillary | Cross-Linked Methylsilicone | 2245. | Maurer and Pfleger, 1987 | 12. m/0.2 mm/0.33 μm, He, 100. C @ 3. min, 30. K/min, 310. C @ 5. min |
Capillary | Cross-Linked Methylsilicone | 2245. | Maurer and Pfleger, 1987 | 12. m/0.2 mm/0.33 μm, He, 100. C @ 3. min, 30. K/min, 310. C @ 5. min |
Capillary | Cross-Linked Methylsilicone | 2245. | Maurer and Pfleger, 1987 | 12. m/0.2 mm/0.33 μm, He, 100. C @ 3. min, 30. K/min, 310. C @ 5. min |
Capillary | Cross-Linked Methylsilicone | 2245. | Maurer and Pfleger, 1987 | 12. m/0.2 mm/0.33 μm, He, 100. C @ 3. min, 30. K/min, 310. C @ 5. min |
Capillary | Cross-Linked Methylsilicone | 2245. | Maurer and Pfleger, 1987 | 12. m/0.2 mm/0.33 μm, He, 100. C @ 3. min, 30. K/min, 310. C @ 5. min |
Capillary | Cross-Linked Methylsilicone | 2245. | Maurer and Pfleger, 1987 | 12. m/0.2 mm/0.33 μm, He, 100. C @ 3. min, 30. K/min, 310. C @ 5. min |
Capillary | Cross-Linked Methylsilicone | 2245. | Maurer and Pfleger, 1987 | 12. m/0.2 mm/0.33 μm, He, 100. C @ 3. min, 30. K/min, 310. C @ 5. min |
Capillary | Cross-Linked Methylsilicone | 2245. | Maurer and Pfleger, 1987 | 12. m/0.2 mm/0.33 μm, He, 100. C @ 3. min, 30. K/min, 310. C @ 5. min |
Capillary | Cross-Linked Methylsilicone | 2245. | Maurer and Pfleger, 1987 | 12. m/0.2 mm/0.33 μm, He, 100. C @ 3. min, 30. K/min, 310. C @ 5. min |
Capillary | Cross-Linked Methylsilicone | 2245. | Maurer and Pfleger, 1987 | 12. m/0.2 mm/0.33 μm, He, 100. C @ 3. min, 30. K/min, 310. C @ 5. min |
Capillary | Cross-Linked Methylsilicone | 2245. | Maurer and Pfleger, 1987 | 12. m/0.2 mm/0.33 μm, He, 100. C @ 3. min, 30. K/min, 310. C @ 5. min |
Capillary | Cross-Linked Methylsilicone | 2245. | Maurer and Pfleger, 1987 | 12. m/0.2 mm/0.33 μm, He, 100. C @ 3. min, 30. K/min, 310. C @ 5. min |

Normal alkane RI, non-polar column, custom temperature program

Column type | Active phase | I | Reference | Comment |
---|---|---|---|---|
Capillary | HP-5MS | 2245. | Augsburger, Rivier, et al., 1998 | 30. m/0.25 mm/0.25 μm; Program: not specified |

References

Maurer, 1990
Maurer, H.H.,
Detection of anticonvulsants and their metabolites in urine within a general unknown analysis procedure using computerized gas chromatography-mass spectrometry,
Arch. Toxicol., 1990, 64, 7, 554-561, https://doi.org/10.1007/BF01971834
. [all data]
Maurer and Pfleger, 1987
Maurer, H.; Pfleger, K.,
Identification and differentiation of benzodiazepines and their metabolites in urine by computerized gas chromatography-mass spectrometry,
J. Chromatogr., 1987, 422, 85-101, https://doi.org/10.1016/0378-4347(87)80442-5
. [all data]
Augsburger, Rivier, et al., 1998
Augsburger, M.; Rivier, L.; Mangin, P.,
Comparison of different immunoassays and GC-MS screening of benzodiazepines in urine,
J. Pharm. Biomed. Anal., 1998, 18, 4-5, 681-687, https://doi.org/10.1016/S0731-7085(98)00266-0
. [all data]