Mercapto-d
- Formula: DS
- Molecular weight: 34.079
- IUPAC Standard InChIKey: PXQLVRUNWNTZOS-MICDWDOJSA-N
- CAS Registry Number: 13780-23-9
- Chemical structure:
View 3d structure (requires JavaScript / HTML 5) - Isotopologues:

Constants of diatomic molecules

Data compiled by: Klaus P. Huber and Gerhard H. Herzberg
Data collected through July, 1977
Symbol | Meaning |
---|---|
State | electronic state and / or symmetry symbol |
Te | minimum electronic energy (cm-1) |
ωe | vibrational constant – first term (cm-1) |
ωexe | vibrational constant – second term (cm-1) |
ωeye | vibrational constant – third term (cm-1) |
Be | rotational constant in equilibrium position (cm-1) |
αe | rotational constant – first term (cm-1) |
γe | rotation-vibration interaction constant (cm-1) |
De | centrifugal distortion constant (cm-1) |
βe | rotational constant – first term, centrifugal force (cm-1) |
re | internuclear distance (Å) |
Trans. | observed transition(s) corresponding to electronic state |
ν00 | position of 0-0 band (units noted in table) |
State | Te | ωe | ωexe | ωeye | Be | αe | γe | De | βe | re | Trans. | ν00 |
---|---|---|---|---|---|---|---|---|---|---|---|---|
H 2Δ | H ← X | 80858 1 | ||||||||||
↳Morrow, 1966 | ||||||||||||
G 2Δ | [4.96] | [1.339] | G ← X | 79319.8 1 | ||||||||
↳Morrow, 1966 | ||||||||||||
F 2Δ | [4.74] | [1.370] | F ← X | 76717.4 1 | ||||||||
↳Morrow, 1966 | ||||||||||||
E 2Σ | [4.739] | [1.35E-4] | [1.3702] | E ← X | 71327.7 1 | |||||||
↳missing citation | ||||||||||||
State | Te | ωe | ωexe | ωeye | Be | αe | γe | De | βe | re | Trans. | ν00 |
D 2Δ | [4.745] | [0.70E-4] | [1.3693] | D ← X | 71205.39 1 | |||||||
↳missing citation | ||||||||||||
C 2Δ | [4.693] | [1.3769] | C ← X | 63872.40 1 | ||||||||
↳Morrow, 1966 | ||||||||||||
B 2Σ | 59581 2 | [1859.16] Z | (29.3) 3 | 4.532 | 0.105 | [1.35E-4] | 1.4011 | B ← X R | 59566.39 Z | |||
↳missing citation | ||||||||||||
A 2Σ+ | 31039 | 1417.0 Z | 48.85 | 4.392 4 | 0.172 | -0.005 | 1.76E-4 | 1.0E-5 | 1.4233 | A ↔ X 5 R | 30769.49 Z | |
↳Ramsay, 1952; missing citation; missing citation | ||||||||||||
State | Te | ωe | ωexe | ωeye | Be | αe | γe | De | βe | re | Trans. | ν00 |
X 2Πi | 0 6 | [1885.5] Z | (30.9) 7 | [4.9003] 8 | 0.100 | [1.35E-4] | 1.3406 9 | |||||
↳Acquista and Schoen, 1970 | ||||||||||||
Hf Λ-doubling sp. 10 | ||||||||||||
↳Meerts and Dymanus, 1975 | ||||||||||||
ESR sp. | ||||||||||||
↳McDonald, 1963 |

Gas phase thermochemistry data

Quantity | Value | Units | Method | Reference | Comment |
---|---|---|---|---|---|
ΔfH°gas | 138.49 | kJ/mol | Review | Chase, 1998 | Data last reviewed in June, 1977 |
Quantity | Value | Units | Method | Reference | Comment |
S°gas,1 bar | 201.49 | J/mol*K | Review | Chase, 1998 | Data last reviewed in June, 1977 |
Gas Phase Heat Capacity (Shomate Equation)
Cp° = A + B*t + C*t2 + D*t3 +
E/t2
H° − H°298.15= A*t + B*t2/2 +
C*t3/3 + D*t4/4 − E/t + F − H
S° = A*ln(t) + B*t + C*t2/2 + D*t3/3 −
E/(2*t2) + G
Cp = heat capacity (J/mol*K)
H° = standard enthalpy (kJ/mol)
S° = standard entropy (J/mol*K)
t = temperature (K) / 1000.
View plot Requires a JavaScript / HTML 5 canvas capable browser.
Temperature (K) | 298. to 1300. | 1300. to 6000. |
---|---|---|
A | 29.43431 | 35.82496 |
B | 0.851444 | 1.351605 |
C | 7.987549 | -0.221301 |
D | -3.842030 | 0.018990 |
E | 0.199828 | -2.556379 |
F | 130.2856 | 122.6866 |
G | 237.6596 | 238.6236 |
H | 138.4900 | 138.4900 |
Reference | Chase, 1998 | Chase, 1998 |
Comment | Data last reviewed in June, 1977 | Data last reviewed in June, 1977 |

References

Morrow, 1966
Morrow, B.A.,
The absorption spectrum of SH and SD in the vacuum ultraviolet,
Can. J. Phys., 1966, 44, 2447. [all data]
Ramsay, 1952
Ramsay, D.A.,
Absorption spectra of SH and SD produced by flash photolysis of H2S and D2S,
J. Chem. Phys., 1952, 20, 1920. [all data]
Acquista and Schoen, 1970
Acquista, N.; Schoen, L.J.,
Matrix isolation spectrum of the SH radical,
J. Chem. Phys., 1970, 53, 1290. [all data]
Meerts and Dymanus, 1975
Meerts, W.L.; Dymanus, A.,
A molecular beam electric resonance study of the hyperfine Λ doubling spectrum of OH, OD, SH, and SD,
Can. J. Phys., 1975, 53, 2123. [all data]
McDonald, 1963
McDonald, C.C.,
EPR spectra of SH, SD, and SO radicals in the gaseous state,
J. Chem. Phys., 1963, 39, 2587. [all data]
Johns and Ramsay, 1961
Johns, J.W.C.; Ramsay, D.A.,
The absorption spectrum and dissociation energy of SH,
Can. J. Phys., 1961, 39, 210. [all data]
Leach, 1950
Leach, M.S.,
Sur les spectres d'emission de l'hydrogene sulfure excites par chocs electroniques. Spectre d'emission du radical SH,
Compt. Rend., 1950, 230, 2181. [all data]
Pathak and Palmer, 1969
Pathak, C.M.; Palmer, H.B.,
Chemical excitation of the A2Σ+-X2Π system of SH and SD,
J. Mol. Spectrosc., 1969, 32, 157. [all data]
Nicholls, Fraser, et al., 1960
Nicholls, R.W.; Fraser, P.A.; Jarmain, W.R.; McEachran, R.P.,
Vibrational transition probabilities of diatomic molecules: collected results. IV. BeO, BO, CH+, CO, NO, SH, O2, O2+,
Astrophys. J., 1960, 131, 399. [all data]
Veseth, 1971
Veseth, L.,
Corrections to the spin-orbit splitting in 2Π states of diatomic molecules,
J. Mol. Spectrosc., 1971, 38, 228. [all data]
Dibeler and Liston, 1968
Dibeler, V.H.; Liston, S.K.,
Mass-spectrometric study of photoionization. XI.Hydrogen sulfide and sulfur dioxide,
J. Chem. Phys., 1968, 49, 482. [all data]
Meyer and Rosmus, 1975
Meyer, W.; Rosmus, P.,
PNO-Cl and CEPA studies of electron correlation effects. III. Spectroscopic constants and dipole moment functions for the ground states of the first-row and second-row diatomic hydrides,
J. Chem. Phys., 1975, 63, 2356. [all data]
Radford and Linzer, 1963
Radford, H.E.; Linzer, M.,
Radio spectrum of SH,
Phys. Rev. Lett., 1963, 10, 443. [all data]
Brown and Thistlethwaite, 1972
Brown, J.M.; Thistlethwaite, P.J.,
A measurment of the λ-doubling transition frequencies for SH in its second rotational level,
Mol. Phys., 1972, 23, 635. [all data]
Tanimoto and Uehara, 1973
Tanimoto, M.; Uehara, H.,
Proton hyperfine interactions in the gas-phase E.P.R. spectra of SH (2Π3/2) in two lowest rotational levels,
Mol. Phys., 1973, 25, 1193. [all data]
Meerts and Dymanus, 1974
Meerts, W.L.; Dymanus, A.,
The hyperfine Λ-doubling spectrum of sulfur hydride in the 2Π3/2 state,
Astrophys. J., 1974, 187, 45. [all data]
Carrington, Levy, et al., 1967
Carrington, A.; Levy, D.H.; Miller, T.A.,
Stark effect in gas-phase electron resonance. The dipole moments of ClO, BrO, SH, and 1ΔSO,
J. Chem. Phys., 1967, 47, 3801. [all data]
Byfleet, Carrington, et al., 1971
Byfleet, C.R.; Carrington, A.; Russell, D.K.,
Electric dipole moments of open-shell diatomic molecules,
Mol. Phys., 1971, 20, 271. [all data]
Cade, Bader, et al., 1969
Cade, P.E.; Bader, R.F.W.; Henneker, W.H.; Keaveny, I.,
Molecular charge distributions and chemical binding. IV. The second-row diatomic hydrides AH,
J. Chem. Phys., 1969, 50, 5313. [all data]
Miller, 1971
Miller, T.A.,
Sulfur-33 hyperfine interactions in the gas-phase electron resonance spectra of 2Π SH and 1Δ SO,
J. Chem. Phys., 1971, 54, 1658. [all data]