Hypochlorous acid-d
- Formula: ClDO
- Molecular weight: 53.467
- CAS Registry Number: 13770-22-4

Gas phase thermochemistry data

Quantity | Value | Units | Method | Reference | Comment |
---|---|---|---|---|---|
ΔfH°gas | -78.24 | kJ/mol | Review | Chase, 1998 | Data last reviewed in March, 1979 |
Quantity | Value | Units | Method | Reference | Comment |
S°gas,1 bar | 240.24 | J/mol*K | Review | Chase, 1998 | Data last reviewed in March, 1979 |
Gas Phase Heat Capacity (Shomate Equation)
Cp° = A + B*t + C*t2 + D*t3 +
E/t2
H° − H°298.15= A*t + B*t2/2 +
C*t3/3 + D*t4/4 − E/t + F − H
S° = A*ln(t) + B*t + C*t2/2 + D*t3/3 −
E/(2*t2) + G
Cp = heat capacity (J/mol*K)
H° = standard enthalpy (kJ/mol)
S° = standard entropy (J/mol*K)
t = temperature (K) / 1000.
View plot Requires a JavaScript / HTML 5 canvas capable browser.
Temperature (K) | 298. to 1300. | 1300. to 6000. |
---|---|---|
A | 33.50915 | 57.30532 |
B | 30.69717 | 0.023909 |
C | -16.96725 | -0.015200 |
D | 3.829808 | 0.021716 |
E | -0.242792 | -7.507184 |
F | -90.26980 | -110.5735 |
G | 270.9952 | 290.9390 |
H | -78.24122 | -78.24122 |
Reference | Chase, 1998 | Chase, 1998 |
Comment | Data last reviewed in March, 1979 | Data last reviewed in March, 1979 |

Vibrational and/or electronic energy levels

Data compiled by: Takehiko Shimanouchi
Symmetry: Cs Symmetry Number σ = 1
Sym. | No | Approximate | Selected Freq. | Infrared | Raman | Comments | ||||
---|---|---|---|---|---|---|---|---|---|---|
Species | type of mode | Value | Rating | Value | Phase | Value | Phase | |||
a' | 1 | OD str | 2666 | B | 2666 M | gas | ||||
a' | 2 | Bend | 911 | C | 911 S | gas | ||||
a' | 3 | OCl str | 739 | C | 739 M | gas | ||||
Source: Shimanouchi, 1972

References

Chase, 1998
Chase, M.W., Jr.,
NIST-JANAF Themochemical Tables, Fourth Edition,
J. Phys. Chem. Ref. Data, Monograph 9, 1998, 1-1951. [all data]
Shimanouchi, 1972
Shimanouchi, T.,
Tables of Molecular Vibrational Frequencies Consolidated Volume II,
J. Phys. Chem. Ref. Data, 1972, 6, 3, 993-1102. [all data]