Phosphoryl chloride fluoride
- Formula: Cl2FOP
- Molecular weight: 136.878
- IUPAC Standard InChIKey: YNECJZSONMVFHE-UHFFFAOYSA-N
- CAS Registry Number: 13769-76-1
- Chemical structure:
View 3d structure (requires JavaScript / HTML 5) - Permanent link for this species. Use this link for bookmarking this species for future reference.

Gas phase thermochemistry data

Quantity | Value | Units | Method | Reference | Comment |
---|---|---|---|---|---|
ΔfH°gas | -765.67 | kJ/mol | Review | Chase, 1998 | Data last reviewed in March, 1963 |
Quantity | Value | Units | Method | Reference | Comment |
S°gas,1 bar | 320.38 | J/mol*K | Review | Chase, 1998 | Data last reviewed in March, 1963 |
Gas Phase Heat Capacity (Shomate Equation)
Cp° = A + B*t + C*t2 + D*t3 +
E/t2
H° − H°298.15= A*t + B*t2/2 +
C*t3/3 + D*t4/4 − E/t + F − H
S° = A*ln(t) + B*t + C*t2/2 + D*t3/3 −
E/(2*t2) + G
Cp = heat capacity (J/mol*K)
H° = standard enthalpy (kJ/mol)
S° = standard entropy (J/mol*K)
t = temperature (K) / 1000.
View plot Requires a JavaScript / HTML 5 canvas capable browser.
Temperature (K) | 298. to 1100. | 1100. to 6000. |
---|---|---|
A | 65.31684 | 107.4355 |
B | 96.71274 | 0.362855 |
C | -85.00633 | -0.073110 |
D | 26.87944 | 0.005042 |
E | -0.711665 | -4.547339 |
F | -791.1358 | -810.5077 |
G | 370.1225 | 431.0482 |
H | -765.6720 | -765.6720 |
Reference | Chase, 1998 | Chase, 1998 |
Comment | Data last reviewed in March, 1963 | Data last reviewed in March, 1963 |

Vibrational and/or electronic energy levels

Data compiled by: Takehiko Shimanouchi
Symmetry: Cs Symmetry Number σ = 1
Sym. | No | Approximate | Selected Freq. | Infrared | Raman | Comments | ||||
---|---|---|---|---|---|---|---|---|---|---|
Species | type of mode | Value | Rating | Value | Phase | Value | Phase | |||
a' | 1 | PO str | 1331 | D | 1331 p | liq. | ||||
a' | 2 | PF str | 894 | D | 894 p | liq. | ||||
a' | 3 | PCl2 s-str | 547 | D | 547 p | liq. | ||||
a' | 4 | PO ip-bend | 386 | D | 386 p | liq. | ||||
a' | 5 | PF bend | 330 | D | 330 p | liq. | ||||
a' | 6 | PCl2 scis | 207 | D | 207 p | liq. | ||||
a | 7 | PCl2 a-str | 620 | D | 620 dp | liq. | ||||
a | 8 | PO op-bend | 372 | D | 372 dp | liq. | ||||
a | 9 | PCl2 rock | 254 | D | 254 dp | liq. | ||||
Source: Shimanouchi, 1972

References

Chase, 1998
Chase, M.W., Jr.,
NIST-JANAF Themochemical Tables, Fourth Edition,
J. Phys. Chem. Ref. Data, Monograph 9, 1998, 1-1951. [all data]
Shimanouchi, 1972
Shimanouchi, T.,
Tables of Molecular Vibrational Frequencies Consolidated Volume II,
J. Phys. Chem. Ref. Data, 1972, 6, 3, 993-1102. [all data]