Diboron dioxide
- Formula: B2O2
- Molecular weight: 53.621
- CAS Registry Number: 13766-28-4

Gas phase thermochemistry data

Quantity | Value | Units | Method | Reference | Comment |
---|---|---|---|---|---|
ΔfH°gas | -456.06 | kJ/mol | Review | Chase, 1998 | Data last reviewed in December, 1964 |
Quantity | Value | Units | Method | Reference | Comment |
S°gas,1 bar | 242.60 | J/mol*K | Review | Chase, 1998 | Data last reviewed in December, 1964 |
Gas Phase Heat Capacity (Shomate Equation)
Cp° = A + B*t + C*t2 + D*t3 +
E/t2
H° − H°298.15= A*t + B*t2/2 +
C*t3/3 + D*t4/4 − E/t + F − H
S° = A*ln(t) + B*t + C*t2/2 + D*t3/3 −
E/(2*t2) + G
Cp = heat capacity (J/mol*K)
H° = standard enthalpy (kJ/mol)
S° = standard entropy (J/mol*K)
t = temperature (K) / 1000.
View plot Requires a JavaScript / HTML 5 canvas capable browser.
Temperature (K) | 298. to 1200. | 1200. to 6000. |
---|---|---|
A | 50.85150 | 83.92351 |
B | 44.77800 | 1.800477 |
C | -19.91191 | -0.351618 |
D | 2.630574 | 0.023697 |
E | -0.462081 | -7.940772 |
F | -474.5869 | -499.4817 |
G | 289.0491 | 319.4103 |
H | -456.0560 | -456.0560 |
Reference | Chase, 1998 | Chase, 1998 |
Comment | Data last reviewed in December, 1964 | Data last reviewed in December, 1964 |

Gas phase ion energetics data

Data compiled as indicated in comments:
LL - Sharon G. Lias and Joel F. Liebman
LBLHLM - Sharon G. Lias, John E. Bartmess, Joel F. Liebman, John L. Holmes, Rhoda D. Levin, and W. Gary Mallard
LLK - Sharon G. Lias, Rhoda D. Levin, and Sherif A. Kafafi
RDSH - Henry M. Rosenstock, Keith Draxl, Bruce W. Steiner, and John T. Herron

Ionization energy determinations

IE (eV) Method Reference Comment
13.9 ± 0.5EIAsano and Kou, 1988LL
13.37 ± 0.34EIBagarat'yan and Nikitin, 1979LLK
14. ± 0.5EIBlackburn, Buchler, et al., 1966RDSH
13.61PERuscic, Curtiss, et al., 1984Vertical value; LBLHLM

Appearance energy determinations

Ion AE (eV) Other Products MethodReferenceComment
B+16.7 ± 0.5BO2EIAsano and Kou, 1988LL
BO+17.6 ± 0.5BOEIAsano and Kou, 1988LL

Vibrational and/or electronic energy levels

Data compiled by: Marilyn E. Jacox

State:   X

Vib.
sym.
 No.   Approximate
 type of mode
 cm-1   Med.   Method   References

Σu+ 3 BO stretch 1898.9 Ar IR Sekachev, Serebrennikov, et al., 1979
Serebrennikov, 1981
Burkholder and Andrews, 1991
3 BO stretch 1894.6 Kr IR Burkholder and Andrews, 1991
Πu 5 Bend 213 Ar IR Sekachev, Serebrennikov, et al., 1979
Serebrennikov, 1981

Additional references: Jacox, 1994, page 184; Ruscic, Curtiss, et al., 1984

References

Chase, 1998
Chase, M.W., Jr.,
NIST-JANAF Themochemical Tables, Fourth Edition,
J. Phys. Chem. Ref. Data, Monograph 9, 1998, 1-1951. [all data]