Phosphino radical
- Formula: H2P
- Molecular weight: 32.98964
- IUPAC Standard InChIKey: FVZVCSNXTFCBQU-UHFFFAOYSA-N
- CAS Registry Number: 13765-43-0
- Chemical structure:
View 3d structure (requires JavaScript / HTML 5) - Permanent link for this species. Use this link for bookmarking this species for future reference.

Gas phase thermochemistry data

Quantity | Value | Units | Method | Reference | Comment |
---|---|---|---|---|---|
ΔfH°gas | 125.94 | kJ/mol | Review | Chase, 1998 | Data last reviewed in March, 1963 |
Quantity | Value | Units | Method | Reference | Comment |
S°gas,1 bar | 212.66 | J/mol*K | Review | Chase, 1998 | Data last reviewed in March, 1963 |
Gas Phase Heat Capacity (Shomate Equation)
Cp° = A + B*t + C*t2 + D*t3 +
E/t2
H° − H°298.15= A*t + B*t2/2 +
C*t3/3 + D*t4/4 − E/t + F − H
S° = A*ln(t) + B*t + C*t2/2 + D*t3/3 −
E/(2*t2) + G
Cp = heat capacity (J/mol*K)
H° = standard enthalpy (kJ/mol)
S° = standard entropy (J/mol*K)
t = temperature (K) / 1000.
View plot Requires a JavaScript / HTML 5 canvas capable browser.
Temperature (K) | 298. to 1300. | 1300. to 6000. |
---|---|---|
A | 25.65240 | 53.33303 |
B | 26.34046 | 2.504020 |
C | -2.484837 | -0.475616 |
D | -2.373633 | 0.031360 |
E | 0.139285 | -8.976605 |
F | 117.6135 | 91.56433 |
G | 236.7600 | 254.3244 |
H | 125.9380 | 125.9380 |
Reference | Chase, 1998 | Chase, 1998 |
Comment | Data last reviewed in March, 1963 | Data last reviewed in March, 1963 |

Reaction thermochemistry data

Data compiled by: John E. Bartmess
Individual Reactions
HP- + =
Quantity | Value | Units | Method | Reference | Comment |
---|---|---|---|---|---|
ΔrH° | 369.8 ± 8.1 | kcal/mol | D-EA | Ervin and Lineberger, 2005 | gas phase |

Gas phase ion energetics data

Data evaluated as indicated in comments:
HL - Edward P. Hunter and Sharon G. Lias
Data compiled as indicated in comments:
B - John E. Bartmess
LBLHLM - Sharon G. Lias, John E. Bartmess, Joel F. Liebman, John L. Holmes, Rhoda D. Levin, and W. Gary Mallard
RDSH - Henry M. Rosenstock, Keith Draxl, Bruce W. Steiner, and John T. Herron
Quantity | Value | Units | Method | Reference | Comment |
---|---|---|---|---|---|
Proton affinity (review) | 169.5 | kcal/mol | N/A | Hunter and Lias, 1998 | HL |
Quantity | Value | Units | Method | Reference | Comment |
Gas basicity | 161.5 | kcal/mol | N/A | Hunter and Lias, 1998 | HL |
Quantity | Value | Units | Method | Reference | Comment |
ΔfH°(+) ion | 260. ± 1. | kcal/mol | N/A | N/A |
Electron affinity determinations
EA (eV) | Method | Reference | Comment |
---|---|---|---|
1.2630 ± 0.0060 | LPES | Ervin and Lineberger, 2005 | High level calcns( Curtiss, Raghavachari, et al., 1991, Ricca and Bauschlicher, 1998) give DH ca. 84; B |
1.271 ± 0.010 | LPES | Zittel and Lineberger, 1976 | B |
0.96 ± 0.11 | D-EA | Bartmess, Scott, et al., 1979 | The D-EA cycle does not close by 7 kcal/mol. The reason for this discrepancy is not known; value altered from reference due to change in acidity scale; B |
1.250 ± 0.030 | PD | Smyth and Brauman, 1972 | B |
1.300 ± 0.030 | LPD | Smyth, McIver, et al., 1971 | B |
>1.14 ± 0.21 | D-EA | Ebinghaus, Kraus, et al., 1964 | B |
1.22443 | N/A | Check, Faust, et al., 2001 | MnF5-(q); ; ΔS(EA)=2.9; B |
1.60014 | SI | Page and Goode, 1969 | The Magnetron method, lacking mass analysis, is not considered reliable.; B |
Ionization energy determinations
IE (eV) | Method | Reference | Comment |
---|---|---|---|
9.824 ± 0.002 | PI | Berkowitz, Curtiss, et al., 1986 | T = 0K; LBLHLM |
9.84 ± 0.01 | PE | Dyke, Jonathan, et al., 1982 | T = 0K; LBLHLM |
9.96 | EI | McAllister and Lossing, 1969 | RDSH |
9.83 ± 0.02 | EI | McAllister and Lossing, 1969 | RDSH |
De-protonation reactions
HP- + =
Quantity | Value | Units | Method | Reference | Comment |
---|---|---|---|---|---|
ΔrH° | 369.8 ± 8.1 | kcal/mol | D-EA | Ervin and Lineberger, 2005 | gas phase; B |

References

Chase, 1998
Chase, M.W., Jr.,
NIST-JANAF Themochemical Tables, Fourth Edition,
J. Phys. Chem. Ref. Data, Monograph 9, 1998, 1-1951. [all data]