Zirconium chloride

Gas phase thermochemistry data

Quantity Value Units Method Reference Comment
Δfgas-186.19kJ/molReviewChase, 1998Data last reviewed in December, 1969
Quantity Value Units Method Reference Comment
gas,1 bar292.56J/mol*KReviewChase, 1998Data last reviewed in December, 1969

Gas Phase Heat Capacity (Shomate Equation)

Cp° = A + B*t + C*t2 + D*t3 + E/t2
H° − H°298.15= A*t + B*t2/2 + C*t3/3 + D*t4/4 − E/t + F − H
S° = A*ln(t) + B*t + C*t2/2 + D*t3/3 − E/(2*t2) + G
    Cp = heat capacity (J/mol*K)
    H° = standard enthalpy (kJ/mol)
    S° = standard entropy (J/mol*K)
    t = temperature (K) / 1000.

View plot Requires a JavaScript / HTML 5 canvas capable browser.

View table.

Temperature (K) 2000. - 6000.
A 48.50511
B 10.95555
C -1.836087
D 0.113018
E 3.999001
F -192.7845
G 357.7295
H -186.1880
ReferenceChase, 1998
Comment Data last reviewed in December, 1969

Condensed phase thermochemistry data

Quantity Value Units Method Reference Comment
Δfliquid-411.59kJ/molReviewChase, 1998Data last reviewed in December, 1969
Quantity Value Units Method Reference Comment
liquid,1 bar122.49J/mol*KReviewChase, 1998Data last reviewed in December, 1969
Quantity Value Units Method Reference Comment
Δfsolid-430.95kJ/molReviewChase, 1998Data last reviewed in December, 1969
Quantity Value Units Method Reference Comment
solid110.03J/mol*KReviewChase, 1998Data last reviewed in December, 1969

Liquid Phase Heat Capacity (Shomate Equation)

Cp° = A + B*t + C*t2 + D*t3 + E/t2
H° − H°298.15= A*t + B*t2/2 + C*t3/3 + D*t4/4 − E/t + F − H
S° = A*ln(t) + B*t + C*t2/2 + D*t3/3 − E/(2*t2) + G
    Cp = heat capacity (J/mol*K)
    H° = standard enthalpy (kJ/mol)
    S° = standard entropy (J/mol*K)
    t = temperature (K) / 1000.

View plot Requires a JavaScript / HTML 5 canvas capable browser.

View table.

Temperature (K) 1000. - 2000.
A 91.00200
B -3.854590×10-9
C 3.028075×10-9
D -7.572581×10-10
E -6.459176×10-11
F -438.7259
G 232.6204
H -411.5943
ReferenceChase, 1998
Comment Data last reviewed in December, 1969

Solid Phase Heat Capacity (Shomate Equation)

Cp° = A + B*t + C*t2 + D*t3 + E/t2
H° − H°298.15= A*t + B*t2/2 + C*t3/3 + D*t4/4 − E/t + F − H
S° = A*ln(t) + B*t + C*t2/2 + D*t3/3 − E/(2*t2) + G
    Cp = heat capacity (J/mol*K)
    H° = standard enthalpy (kJ/mol)
    S° = standard entropy (J/mol*K)
    t = temperature (K) / 1000.

View plot Requires a JavaScript / HTML 5 canvas capable browser.

View table.

Temperature (K) 298. - 1000.
A 72.36395
B 13.68883
C 3.588249
D -3.543668
E -0.359565
F -454.3782
G 191.3678
H -430.9520
ReferenceChase, 1998
Comment Data last reviewed in December, 1969

References

Chase, 1998
Chase, M.W., Jr., NIST-JANAF Themochemical Tables, Fourth Edition, J. Phys. Chem. Ref. Data, Monograph 9, 1998, 1-1951. [all data]