Lidocaine
- Formula: C14H22N2O
- Molecular weight: 234.3373
- IUPAC Standard InChIKey: NNJVILVZKWQKPM-UHFFFAOYSA-N
- CAS Registry Number: 137-58-6
- Chemical structure:
View 3d structure (requires JavaScript / HTML 5) - Other names: Acetamide, 2-(diethylamino)-N-(2,6-dimethylphenyl)-; 2',6'-Acetoxylidide, 2-(diethylamino)-; α-(Diethylamino)-2,6-acetoxylidide; Anestacon; Duncaine; Gravocain; Isicaina; Isicaine; Leostesin; Lignocaine; Maricaine; Rucaina; Solcain; Xycaine; Xylestesin; Xylocain; Xylocaine; Xylocitin; Xylotox; 2-(Diethylamino)-2',6'-acetoxylidide; α-Diethylamino-2,6-dimethylacetanilide; α-Diethylaminoaceto-2,6-xylidide; ω-Diethylamino-2,6-dimethylacetanilide; Cappicaine; Cito optadren; Diethylaminoaceto-2,6-xylidide; Esracaine; L-Caine; Lida-Mantle; Xilina; Xyloneural (free base); Diethylaminoacet-2,6-xylidide; alfa-Dietilamino-2,6-dimetilacetanilide; Xilocaina; Xyline; Remicaine; Anbesol; Cuivasil; Dalcaine; Solarcaine; N-(2,6-Dimethylphenyl)-N2,N2-diethylglycinamide; Lidoderm; ELA-Max; Jetocaine

Phase change data

Data compiled as indicated in comments:
BS - Robert L. Brown and Stephen E. Stein
AC - William E. Acree, Jr., James S. Chickos
Reduced pressure boiling point
Tboil (K) | Pressure (bar) | Reference | Comment |
---|---|---|---|
454.2 | 0.005 | Weast and Grasselli, 1989 | BS |
Enthalpy of fusion
ΔfusH (kJ/mol) | Temperature (K) | Method | Reference | Comment |
---|---|---|---|---|
16.4 | 340.7 | DSC | Lazerges, Rietveld, et al., 2010 | AC |
18.8 | 341. | DSC | Wassvik, Holmén, et al., 2008 | AC |

Kovats' RI, non-polar column, isothermal

View large format table.

Column type Active phase Temperature (C) I Reference Comment
CapillaryBP-1200.1875.Japp, Gill, et al., 198725. m/0.22 mm/0.25 μm, N2
CapillaryBP-1200.1882.Japp, Gill, et al., 198725. m/0.53 mm/1. μm, N2
PackedSE-30180.1875.Musumarra, Scarlata, et al., 1987N2, 1% se-30 on Anachrom ABS(80-100mesh); Column length: 2. m
PackedSE-30220.1900.Mari, Bertol, et al., 1984Anakrom ABS; Column length: 2. m
PackedSE-30260.1850.Mari, Bertol, et al., 1984Anakrom ABS; Column length: 2. m
PackedOV-101170.1859.Delbeke, Debackere, et al., 1981
PackedOV-101180.1866.Delbeke, Debackere, et al., 1981
PackedOV-1200.1885.Berninger and Möller, 1977

Kovats' RI, non-polar column, temperature ramp

View large format table.

Column type Active phase I Reference Comment
PackedOV-1011875.Maurer, 1990N2, Chromosorb G HP, 100. C @ 3. min, 30. K/min, 310. C @ 5. min; Column length: 0.60 m
CapillarySE-301869.Schepers, Wijsbeek, et al., 198225. m/0.49 mm/1.14 μm, 100. C @ 2. min, 8. K/min, 275. C @ 15. min

Kovats' RI, non-polar column, custom temperature program

View large format table.

Column type Active phase I Reference Comment
PackedOV-1011860.McLinden and Stenhouse, 1979N2, Chromosorb W; Column length: 2. m; Program: not specified

Van Den Dool and Kratz RI, non-polar column, temperature ramp

View large format table.

Column type Active phase I Reference Comment
CapillarySPB-11884.Christ, Noomano, et al., 198830. m/0.75 mm/1.0 μm, He, 10. K/min, 280. C @ 12. min; Tstart: 160. C
CapillaryCBP-11838.Oyama, Sano, et al., 1987N2, 6. K/min; Column length: 12. m; Column diameter: 0.53 mm; Tstart: 120. C; Tend: 250. C
PackedMethyl Silicone1881.Bogusz, Wijsbeek, et al., 1985120. C @ 4. min, 7. K/min, 290. C @ 10. min
PackedMethyl Silicone1890.Bogusz, Wijsbeek, et al., 1985120. C @ 4. min, 7. K/min, 290. C @ 10. min
PackedMethyl Silicone1880.Bogusz, Wijsbeek, et al., 1985120. C @ 4. min, 7. K/min, 290. C @ 10. min
PackedMethyl Silicone1880.Bogusz, Wijsbeek, et al., 1985120. C @ 4. min, 7. K/min, 290. C @ 10. min
PackedMethyl Silicone1882.Bogusz, Wijsbeek, et al., 1985120. C @ 4. min, 7. K/min, 290. C @ 10. min
PackedMethyl Silicone1882.Bogusz, Wijsbeek, et al., 1985120. C @ 4. min, 7. K/min, 290. C @ 10. min
PackedMethyl Silicone1882.Bogusz, Wijsbeek, et al., 1985120. C @ 4. min, 7. K/min, 290. C @ 10. min
PackedMethyl Silicone1882.Bogusz, Wijsbeek, et al., 1985120. C @ 4. min, 7. K/min, 290. C @ 10. min
PackedMethyl Silicone1885.Bogusz, Wijsbeek, et al., 1985120. C @ 4. min, 7. K/min, 290. C @ 10. min
PackedMethyl Silicone1885.Bogusz, Wijsbeek, et al., 1985120. C @ 4. min, 7. K/min, 290. C @ 10. min
PackedMethyl Silicone1890.Bogusz, Wijsbeek, et al., 1985120. C @ 4. min, 7. K/min, 290. C @ 10. min
PackedMethyl Silicone1892.Bogusz, Wijsbeek, et al., 1985120. C @ 4. min, 7. K/min, 290. C @ 10. min
PackedMethyl Silicone1895.Bogusz, Wijsbeek, et al., 1985120. C @ 4. min, 7. K/min, 290. C @ 10. min
PackedMethyl Silicone1865.Bogusz, Wijsbeek, et al., 1985120. C @ 4. min, 7. K/min, 290. C @ 10. min
PackedMethyl Silicone1882.Bogusz, Wijsbeek, et al., 1985120. C @ 4. min, 7. K/min, 290. C @ 10. min
PackedMethyl Silicone1885.Bogusz, Wijsbeek, et al., 1985120. C @ 4. min, 7. K/min, 290. C @ 10. min
PackedMethyl Silicone1885.Bogusz, Wijsbeek, et al., 1985120. C @ 4. min, 7. K/min, 290. C @ 10. min
PackedMethyl Silicone1885.Bogusz, Wijsbeek, et al., 1985120. C @ 4. min, 7. K/min, 290. C @ 10. min
PackedMethyl Silicone1885.Bogusz, Wijsbeek, et al., 1985120. C @ 4. min, 7. K/min, 290. C @ 10. min
PackedMethyl Silicone1885.Bogusz, Wijsbeek, et al., 1985120. C @ 4. min, 7. K/min, 290. C @ 10. min
PackedMethyl Silicone1890.Bogusz, Wijsbeek, et al., 1985120. C @ 4. min, 7. K/min, 290. C @ 10. min
PackedMethyl Silicone1890.Bogusz, Wijsbeek, et al., 1985120. C @ 4. min, 7. K/min, 290. C @ 10. min
PackedMethyl Silicone1890.Bogusz, Wijsbeek, et al., 1985120. C @ 4. min, 7. K/min, 290. C @ 10. min
PackedMethyl Silicone1893.Bogusz, Wijsbeek, et al., 1985120. C @ 4. min, 7. K/min, 290. C @ 10. min
PackedMethyl Silicone1895.Bogusz, Wijsbeek, et al., 1985120. C @ 4. min, 7. K/min, 290. C @ 10. min
PackedMethyl Silicone1875.Bogusz, Wijsbeek, et al., 1985120. C @ 4. min, 7. K/min, 290. C @ 10. min
PackedMethyl Silicone1875.Bogusz, Wijsbeek, et al., 1985120. C @ 4. min, 7. K/min, 290. C @ 10. min
PackedMethyl Silicone1875.Bogusz, Wijsbeek, et al., 1985120. C @ 4. min, 7. K/min, 290. C @ 10. min
PackedMethyl Silicone1875.Bogusz, Wijsbeek, et al., 1985120. C @ 4. min, 7. K/min, 290. C @ 10. min
PackedMethyl Silicone1875.Bogusz, Wijsbeek, et al., 1985120. C @ 4. min, 7. K/min, 290. C @ 10. min
PackedMethyl Silicone1880.Bogusz, Wijsbeek, et al., 1985120. C @ 4. min, 7. K/min, 290. C @ 10. min
PackedMethyl Silicone1880.Bogusz, Wijsbeek, et al., 1985120. C @ 4. min, 7. K/min, 290. C @ 10. min
PackedMethyl Silicone1880.Bogusz, Wijsbeek, et al., 1985120. C @ 4. min, 7. K/min, 290. C @ 10. min
PackedMethyl Silicone1880.Bogusz, Wijsbeek, et al., 1985120. C @ 4. min, 7. K/min, 290. C @ 10. min
PackedMethyl Silicone1880.Bogusz, Wijsbeek, et al., 1985120. C @ 4. min, 7. K/min, 290. C @ 10. min
PackedMethyl Silicone1885.Bogusz, Wijsbeek, et al., 1985120. C @ 4. min, 7. K/min, 290. C @ 10. min
PackedMethyl Silicone1895.Bogusz, Wijsbeek, et al., 1985120. C @ 4. min, 7. K/min, 290. C @ 10. min
CapillaryDB-11854.Perrigo, Peel, et al., 198515. m/0.32 mm/0.25 μm, He, 8. K/min, 280. C @ 5. min; Tstart: 120. C
CapillaryMethyl Silicone1852.0Newton and Foery, 198412. m/0.2 mm/0.33 μm, He, 50. C @ 1. min, 20. K/min, 300. C @ 3. min
CapillaryDB-11854.Perrigo, Ballantyne, et al., 198415. m/0.25 mm/0.25 μm, He, 8. K/min, 280. C @ 5. min; Tstart: 120. C
CapillaryDB-11860.Perrigo, Ballantyne, et al., 198415. m/0.25 mm/0.25 μm, He, 12. K/min, 280. C @ 5. min; Tstart: 120. C
CapillaryDB-11863.Perrigo, Ballantyne, et al., 198415. m/0.25 mm/0.25 μm, He, 15. K/min, 280. C @ 5. min; Tstart: 120. C
CapillaryDB-11848.Perrigo, Ballantyne, et al., 198415. m/0.25 mm/0.25 μm, He, 5. K/min, 280. C @ 5. min; Tstart: 120. C
CapillarySE-301842.Anderson and Stafford, 198315. m/0.25 mm/0.25 μm, He, 5. K/min; Tstart: 100. C; Tend: 295. C
PackedSE-301865.Perrigo and Peel, 1981N2, Chromosorb W, 130. C @ 2. min, 8. K/min, 290. C @ 8. min; Column length: 1.8 m

Van Den Dool and Kratz RI, non-polar column, custom temperature program

View large format table.

Column type Active phase I Reference Comment
CapillaryCP Sil 5 CB1881.Aderjan and Bogusz, 198810. m/0.53 mm/5.0 μm, He; Program: 100 0C (2 min ) 15 0C/min -> 200 0C 10 0C/min -> 300 0C (8 min hold)
CapillaryCP Sil 5 CB1870.Aderjan and Bogusz, 198810. m/0.53 mm/5.0 μm, He; Program: not specified
CapillaryBP-11857.Stowell and Wilson, 198712. m/0.22 mm/0.25 μm, He; Program: 120C => 8C/min => 270C => 25C/min => 300C

Normal alkane RI, non-polar column, temperature ramp

View large format table.

Column type Active phase I Reference Comment
CapillaryPolymethylsiloxane, (PMS-20000)1870.Gambaro, Saligari, et al., 199712. m/0.20 mm/0.33 μm, He, 10. K/min; Tstart: 160. C; Tend: 300. C
CapillaryDB-51842.Phillips, Logan, et al., 199015. m/0.25 mm/0.2 μm, He, 10. K/min; Tstart: 185. C; Tend: 270. C
CapillaryDB-11844.Anderson and Fuller, 198710. m/0.53 mm/2.65 μm, He, 5. K/min; Tstart: 130. C; Tend: 230. C
CapillaryBP-11842.Stowell and Wilson, 198512. m/0.22 mm/0.25 μm, He, 5. K/min; Tstart: 100. C; Tend: 295. C
CapillaryBP-11854.Stowell and Wilson, 198512. m/0.22 mm/0.25 μm, He, 8. K/min; Tstart: 120. C; Tend: 280. C
CapillaryBP-11852.Stowell and Wilson, 198512. m/0.22 mm/0.25 μm, He, 20. K/min; Tstart: 50. C; Tend: 300. C
PackedSE-301860.Marozzi, Gambaro, et al., 1982Gas Chrom P, 2.5 K/min; Column length: 2. m; Tstart: 120. C; Tend: 200. C
PackedSE-301865.Peel and Perrigo, 1976Nitrogen, Chromosorb W AW DMS (80-100 mesh), 130. C @ 2. min, 8. K/min, 290. C @ 8. min; Column length: 2. m
PackedSE-301865.Peel and Perrigo, 1975N2, Chromosorb W AW DMS, 130. C @ 2. min, 8. K/min, 290. C @ 8. min; Column length: 2. m

Normal alkane RI, non-polar column, custom temperature program

View large format table.

Column type Active phase I Reference Comment
Capillary5 % Phenyl methyl siloxane1924.Grigoriev and Savchuk, 201025. m/0.20 mm/0.33 μm; Program: 50 0C (0.5 min) 99 0C/min -> 100 0C (1 min) 15 0C/min -> 280 0C (20 min)
Capillary5 % Phenyl methyl siloxane1924.Grigoriev and Savchuk, 201025. m/0.20 mm/0.33 μm; Program: 50 0C (0.5 min) 99 0C/min -> 100 0C (1 min) 15 0C/min -> 280 0C (20 min)
CapillaryHP-11875.Grigor'ev, Bozhko, et al., 2009Helium; Program: not specified
CapillaryPolymethylsiloxane, (PMS-20000)1841.Gambaro, Saligari, et al., 199712. m/0.20 mm/0.33 μm, He; Program: not specified
CapillaryPolymethylsiloxane, (PMS-20000)1842.Gambaro, Saligari, et al., 199712. m/0.20 mm/0.33 μm, He; Program: not specified
CapillaryBP-11856.Stowell and Wilson, 198512. m/0.22 mm/0.25 μm, He; Program: 120 0X 8 0C/min -> 270 0C 25 0C/min -> 300 0C (5 min)
CapillaryBP-11857.Stowell and Wilson, 198512. m/0.22 mm/0.25 μm, He; Program: 120 0X 8 0C/min -> 270 0C 25 0C/min -> 300 0C (5 min)
CapillaryBP-11857.Stowell and Wilson, 198512. m/0.22 mm/0.25 μm, He; Program: 120 0X 8 0C/min -> 270 0C 25 0C/min -> 300 0C (5 min)
CapillaryBP-11858.Stowell and Wilson, 198512. m/0.22 mm/0.25 μm, He; Program: 120 0X 8 0C/min -> 270 0C 25 0C/min -> 300 0C (5 min)
CapillaryBP-11858.Stowell and Wilson, 198512. m/0.22 mm/0.25 μm, He; Program: 120 0X 8 0C/min -> 270 0C 25 0C/min -> 300 0C (5 min)
CapillaryBP-11860.Stowell and Wilson, 198512. m/0.22 mm/0.25 μm, He; Program: not specified
OtherMethyl Silicone1870.Ardrey and Moffat, 1981Program: not specified

References

Weast and Grasselli, 1989
CRC Handbook of Data on Organic Compounds, 2nd Editon, Weast,R.C and Grasselli, J.G., ed(s)., CRC Press, Inc., Boca Raton, FL, 1989, 1. [all data]
Lazerges, Rietveld, et al., 2010
Lazerges, Mathieu; Rietveld, Ivo B.; Corvis, Yohann; Céolin, René; Espeau, Philippe,
Thermodynamic studies of mixtures for topical anesthesia: Lidocaine--salol binary phase diagram,
Thermochimica Acta, 2010, 497, 1-2, 124-128, https://doi.org/10.1016/j.tca.2009.08.016
. [all data]
Wassvik, Holmén, et al., 2008
Wassvik, Carola M.; Holmén, Anders G.; Draheim, Rieke; Artursson, Per; Bergström, Christel A.S.,
Molecular Characteristics for Solid-State Limited Solubility,
J. Med. Chem., 2008, 51, 10, 3035-3039, https://doi.org/10.1021/jm701587d
. [all data]