cis-Bicyclo[6.1.0]nonane
- Formula: C9H16
- Molecular weight: 124.2233
- IUPAC Standard InChIKey: FYECUAIUGWFPJF-DTORHVGOSA-N
- CAS Registry Number: 13757-43-2
- Chemical structure:
View 3d structure (requires JavaScript / HTML 5) - Stereoisomers:

Gas phase thermochemistry data

Data compiled as indicated in comments:
ALS - Hussein Y. Afeefy, Joel F. Liebman, and Stephen E. Stein
DRB - Donald R. Burgess, Jr.
GT - Glushko Thermocenter, Russian Academy of Sciences, Moscow
Quantity | Value | Units | Method | Reference | Comment |
---|---|---|---|---|---|
ΔfH°gas | -20.8 ± 1.1 | kJ/mol | Ccb | Wiberg, Lupton, et al., 1984 | Author was aware that data differs from previously reported values; see Lupton, 1970; ALS |
ΔfH°gas | -21.0 | kJ/mol | N/A | Wiberg, 1980 | Value computed using ΔfHliquid° value of -70.0±1.0 kj/mol from Wiberg, 1980 and ΔvapH° value of 49.0 kj/mol from Chang, McNally, et al., 1970.; DRB |
ΔfH°gas | -31.2 ± 2.9 | kJ/mol | Ccb | Corbally and Perkins, 1978 | Reanalyzed by Pedley, Naylor, et al., 1986, Original value = -30.5 ± 3.8 kJ/mol; ALS |
ΔfH°gas | -32. ± 4.2 | kJ/mol | Ccb | Chang, McNally, et al., 1970 | ALS |
Constant pressure heat capacity of gas
Cp,gas (J/mol*K) | Temperature (K) | Reference | Comment |
---|---|---|---|
159.54 | 298.15 | Chang S., 1970 | These values were calculated by a method of force field; their uncertainties may exceed 5-10 J/mol*K.; GT |
218.40 | 400. | ||
270.87 | 500. |

Condensed phase thermochemistry data

Data compiled as indicated in comments:
ALS - Hussein Y. Afeefy, Joel F. Liebman, and Stephen E. Stein
DH - Eugene S. Domalski and Elizabeth D. Hearing
Quantity | Value | Units | Method | Reference | Comment |
---|---|---|---|---|---|
ΔfH°liquid | -70.1 ± 1.0 | kJ/mol | Ccb | Wiberg, Lupton, et al., 1984 | Author was aware that data differs from previously reported values; see Lupton, 1970; ALS |
ΔfH°liquid | -70.00 ± 0.96 | kJ/mol | Ccb | Wiberg, 1980 | Heat of combustion is not reported; ALS |
ΔfH°liquid | -80.3 ± 3.7 | kJ/mol | Ccb | Corbally and Perkins, 1978 | ALS |
ΔfH°liquid | -81. ± 3. | kJ/mol | Ccb | Chang, McNally, et al., 1970 | ALS |
Quantity | Value | Units | Method | Reference | Comment |
ΔcH°liquid | -5758.23 ± 0.92 | kJ/mol | Ccb | Wiberg, Lupton, et al., 1984 | Author was aware that data differs from previously reported values; see Lupton, 1970; Corresponding ΔfHºliquid = -70.00 kJ/mol (simple calculation by NIST; no Washburn corrections); ALS |
ΔcH°liquid | -5747. ± 3. | kJ/mol | Ccb | Chang, McNally, et al., 1970 | Corresponding ΔfHºliquid = -81.2 kJ/mol (simple calculation by NIST; no Washburn corrections); ALS |
Constant pressure heat capacity of liquid
Cp,liquid (J/mol*K) | Temperature (K) | Reference | Comment |
---|---|---|---|
235.1 | 315. | Chang, McNally, et al., 1970 | DH |

Phase change data

Data compiled as indicated in comments:
ALS - Hussein Y. Afeefy, Joel F. Liebman, and Stephen E. Stein
DRB - Donald R. Burgess, Jr.
AC - William E. Acree, Jr., James S. Chickos
Quantity | Value | Units | Method | Reference | Comment |
---|---|---|---|---|---|
ΔvapH° | 49.3 ± 0.5 | kJ/mol | AVG | N/A | Average of 6 values; Individual data points |
Enthalpy of vaporization
ΔvapH (kJ/mol) | Temperature (K) | Method | Reference | Comment |
---|---|---|---|---|
50.4 ± 0.8 | 312. | A | Stephenson and Malanowski, 1987 | Based on data from 297. to 360. K. See also Chang, McNally, et al., 1970.; AC |

Kovats' RI, non-polar column, isothermal

Column type | Active phase | Temperature (C) | I | Reference | Comment |
---|---|---|---|---|---|
Capillary | Squalane | 90. | 996. | Engewald, Epsch, et al., 1976 | N2; Column length: 100. m; Column diameter: 0.23 mm |
Capillary | Squalane | 100. | 1003. | Schomburg, 1967 | Ar; Column length: 100. m |

References

Wiberg, Lupton, et al., 1984
Wiberg, K.B.; Lupton, E.C., Jr.; Wasserman, D.J.; de Meijere, A.,
Enthalpies of formation of cis- and trans-1,2-diethylcyclopropane and cis- and trans-bicyclo[6.1.0]nonane. Structural effects on energies of cyclopropane rings,
J. Am. Chem. Soc., 1984, 106, 1740-1744. [all data]
Lupton, 1970
Lupton, E.C., Jr.,
The thermochemistry of some small ring compounds,
Diss. Abs., 1970, 31, 1174-1175. [all data]
Wiberg, 1980
Wiberg, K.B.,
Energies of organic compounds,
Rept. DOE-E(11-1)4060 Prepared for US Dept. of Energy by Yale Univ., New Haven, CT. Avail. NTIS, 1980, 1-24. [all data]
Chang, McNally, et al., 1970
Chang, Sho-ju.; McNally, D.; Shary-Tehrany, S.; Hickey, S.M.J.; Boyd, R.H.,
The heats of combustion and strain energies of bicylo[n.m.O]alkanes,
J. Am. Chem. Soc., 1970, 92, 3109-3118. [all data]
Corbally and Perkins, 1978
Corbally, R.P.; Perkins, M.J.,
Standard enthalpies of formation of cis- and trans- bicyclo[6.1.0]nonanes,
J. Chem. Soc. Chem. Commun., 1978, 778-779. [all data]
Pedley, Naylor, et al., 1986
Pedley, J.B.; Naylor, R.D.; Kirby, S.P.,
Thermochemical Data of Organic Compounds, Chapman and Hall, New York, 1986, 1-792. [all data]
Chang S., 1970
Chang S.,
The heats of combustion and strain energies of bicyclo[n.m.0]alkanes,
J. Am. Chem. Soc., 1970, 92, 3109-3118. [all data]
Stephenson and Malanowski, 1987
Stephenson, Richard M.; Malanowski, Stanislaw,
Handbook of the Thermodynamics of Organic Compounds, 1987, https://doi.org/10.1007/978-94-009-3173-2
. [all data]
Engewald, Epsch, et al., 1976
Engewald, W.; Epsch, K.; Welsch, Th.; Graefe, J.,
Molekülstruktur und Retentionsverhalten. VI. Retentionsverhalten von bicycle[n.m.0]alkanen bei der gas-adsorptions- und gas-verteilungs-chromatographie,
J. Chromatogr., 1976, 119, 119-128, https://doi.org/10.1016/S0021-9673(00)86776-X
. [all data]
Schomburg, 1967
Schomburg, G.,
Struktur und Retentionsverhalten von Offenkettigen und Cyclischen Kohlenwasserstoffen und Deren Einfacher Substitutionsprodukte,
Anal. Chim. Acta., 1967, 38, 45-64, https://doi.org/10.1016/S0003-2670(01)80560-2
. [all data]