1-Butanol, 2-methyl-
- Formula: C5H12O
- Molecular weight: 88.1482
- IUPAC Standard InChIKey: QPRQEDXDYOZYLA-UHFFFAOYSA-N
- CAS Registry Number: 137-32-6
- Chemical structure:
View 3d structure (requires JavaScript / HTML 5) - Species with the same structure:
- Isotopologues:
- Stereoisomers:
- Other names: sec-Butylcarbinol; Active amyl alcohol; Active primary amyl alcohol; Primary active amyl alcohol; 2-Methyl-n-butanol; 2-Methyl-1-butanol; 2-Methylbutyl alcohol; CH3CH2CH(CH3)CH2OH; dl-2-Methyl-1-butanol; 2-Methyl butanol-1; 2-Methylbutanol; dl-sec-Butyl carbinol; Butanol, 2-methyl-; 2-Methyl-butan-1-ol; 3-Methyl iso-butanol; Methyl-2-butan-1-ol; NSC 8431; 34713-94-5; 2-methyl-1-butanol (active amyl alcohol)

Gas phase thermochemistry data

Data compiled by: Hussein Y. Afeefy, Joel F. Liebman, and Stephen E. Stein
Quantity | Value | Units | Method | Reference | Comment |
---|---|---|---|---|---|
ΔfH°gas | -302.0 ± 1.5 | kJ/mol | Ccb | Chao and Rossini, 1965 | Heat of formation derived by Cox and Pilcher, 1970 |

Condensed phase thermochemistry data

Data compiled by: Hussein Y. Afeefy, Joel F. Liebman, and Stephen E. Stein
Quantity | Value | Units | Method | Reference | Comment |
---|---|---|---|---|---|
ΔfH°liquid | -356.6 ± 0.63 | kJ/mol | Ccb | Chao and Rossini, 1965 | |
Quantity | Value | Units | Method | Reference | Comment |
ΔcH°liquid | -3325.9 ± 0.54 | kJ/mol | Ccb | Chao and Rossini, 1965 | Corresponding ΔfHºliquid = -356.6 kJ/mol (simple calculation by NIST; no Washburn corrections) |

Phase change data

Data compiled as indicated in comments:
BS - Robert L. Brown and Stephen E. Stein
TRC - Thermodynamics Research Center, NIST Boulder Laboratories, Chris Muzny director
ALS - Hussein Y. Afeefy, Joel F. Liebman, and Stephen E. Stein
DRB - Donald R. Burgess, Jr.
AC - William E. Acree, Jr., James S. Chickos
Quantity | Value | Units | Method | Reference | Comment |
---|---|---|---|---|---|
Tboil | 402. ± 2. | K | AVG | N/A | Average of 29 values; Individual data points |
Quantity | Value | Units | Method | Reference | Comment |
Tc | 575.4 ± 0.5 | K | N/A | Gude and Teja, 1995 | |
Tc | 575.4 | K | N/A | Quadri, Khilar, et al., 1991 | Uncertainty assigned by TRC = 0.7 K; TRC |
Quantity | Value | Units | Method | Reference | Comment |
Pc | 39.4 ± 0.2 | bar | N/A | Gude and Teja, 1995 | |
Pc | 39.40 | bar | N/A | Quadri, Khilar, et al., 1991 | Uncertainty assigned by TRC = 0.40 bar; TRC |
Quantity | Value | Units | Method | Reference | Comment |
ΔvapH° | 54.6 ± 1.3 | kJ/mol | V | Chao and Rossini, 1965 | Heat of formation derived by Cox and Pilcher, 1970; ALS |
ΔvapH° | 54.6 | kJ/mol | N/A | Chao and Rossini, 1965 | DRB |
ΔvapH° | 54.1 | kJ/mol | C | McCurdy and Laidler, 1963 | AC |
Enthalpy of vaporization
ΔvapH (kJ/mol) | Temperature (K) | Method | Reference | Comment |
---|---|---|---|---|
43.4 | 317. | N/A | Easton, Hargreaves, et al., 2007 | Based on data from 302. to 410. K. See also Boublik, Fried, et al., 1984.; AC |
51.2 | 345. | N/A | Aucejo, Burguet, et al., 1994 | Based on data from 330. to 405. K.; AC |
49.8 | 353. | A | Stephenson and Malanowski, 1987 | Based on data from 338. to 402. K.; AC |
53.9 | 332. | A | Stephenson and Malanowski, 1987 | Based on data from 317. to 403. K.; AC |
58.5 | 264. | A | Stephenson and Malanowski, 1987 | Based on data from 249. to 319. K. See also Thomas, Meatyard, et al., 1979.; AC |
56.7 | 313. | N/A | Boublik, Fried, et al., 1984 | Based on data from 298. to 393. K. See also Butler, Ramchandani, et al., 1935.; AC |
56.1 | 322. | N/A | Wilhoit and Zwolinski, 1973 | Based on data from 307. to 403. K.; AC |
Antoine Equation Parameters
log10(P) = A − (B / (T + C))
P = vapor pressure (bar)
T = temperature (K)
View plot Requires a JavaScript / HTML 5 canvas capable browser.
Temperature (K) | A | B | C | Reference | Comment |
---|---|---|---|---|---|
298.12 to 393.70 | 4.48266 | 1360.367 | -99.937 | Butler, Ramchandani, et al., 1935, 2 | Coefficents calculated by NIST from author's data. |

Henry's Law data

Data compiled by: Rolf Sander
Henry's Law constant (water solution)
kH(T) = k°H exp(d(ln(kH))/d(1/T) ((1/T) - 1/(298.15 K)))
k°H = Henry's law constant for solubility in water at 298.15 K (mol/(kg*bar))
d(ln(kH))/d(1/T) = Temperature dependence constant (K)
k°H (mol/(kg*bar)) | d(ln(kH))/d(1/T) (K) | Method | Reference |
---|---|---|---|
70. | M | Butler, Ramchandani, et al., 1935, 2 |

Reaction thermochemistry data

Data compiled by: John E. Bartmess
Individual Reactions
C5H11O- + =
By formula: C5H11O- + H+ = C5H12O
Quantity | Value | Units | Method | Reference | Comment |
---|---|---|---|---|---|
ΔrH° | 373.9 ± 2.0 | kcal/mol | CIDC | Haas and Harrison, 1993 | gas phase; Both metastable and 50 eV collision energy. |
Quantity | Value | Units | Method | Reference | Comment |
ΔrG° | 367.3 ± 2.1 | kcal/mol | H-TS | Haas and Harrison, 1993 | gas phase; Both metastable and 50 eV collision energy. |

Gas phase ion energetics data

Data compiled as indicated in comments:
B - John E. Bartmess
LLK - Sharon G. Lias, Rhoda D. Levin, and Sherif A. Kafafi
Ionization energy determinations
IE (eV) | Method | Reference | Comment |
---|---|---|---|
9.86 | EI | Holmes, Fingas, et al., 1981 | LLK |
De-protonation reactions
C5H11O- + =
By formula: C5H11O- + H+ = C5H12O
Quantity | Value | Units | Method | Reference | Comment |
---|---|---|---|---|---|
ΔrH° | 373.9 ± 2.0 | kcal/mol | CIDC | Haas and Harrison, 1993 | gas phase; Both metastable and 50 eV collision energy.; B |
Quantity | Value | Units | Method | Reference | Comment |
ΔrG° | 367.3 ± 2.1 | kcal/mol | H-TS | Haas and Harrison, 1993 | gas phase; Both metastable and 50 eV collision energy.; B |

Van Den Dool and Kratz RI, non-polar column, custom temperature program

Data compiled by: NIST Mass Spectrometry Data Center, William E. Wallace, director

Column type CapillaryCapillaryCapillaryCapillaryCapillary
Active phase HP-5MSSE-54SE-54DB-5DB-1
Column length (m) 30.30.30.60.60.
Carrier gas HeHeHeHeHe
Substrate
Column diameter (mm) 0.250.320.320.320.32
Phase thickness (μm) 0.250.250.251.1.
Program 60C (1 min) => 5 C/min => 210C => 10 C/min => 280C (15 min)35C(2min) => 40C/min => 50C(2min) => 6C/min => 180C => 20C/min => 230C(10min)35C(2min) => 40C/min => 50C(2min) => 6C/min => 180C => 20C/min => 230C(10min)40 C(4min) => 2C/min => 90C => 4C/min => 130C => 8C/min => 250C35C(5min) => 10C/min => 45C (5min) => 5C/min => 250C (10min)
I 762.732.740.747.726.
ReferenceAndriamaharavo, 2014Fritsch and Schieberle, 2005Fritsch and Schieberle, 2005Mayr, van Ruth, et al., 2003Place, Imhof, et al., 2003
Comment MSDC-RI MSDC-RI MSDC-RI MSDC-RI MSDC-RI
Column type CapillaryCapillaryCapillaryCapillaryCapillary
Active phase RTX-5CP Sil 8 CBDB-5DB-5MSDB-5MS
Column length (m)  60.30.30.30.
Carrier gas  HeHeH2H2
Substrate
Column diameter (mm)  0.250.250.250.25
Phase thickness (μm)  0.250.250.250.25
Program not specified0C => rapidly => 40C(8min) => 4C/min => 250C(10min)50C (1min) => 5C/min => 100C => 10C/min => 250C (9min)40C (5min) => 2C/min => 200C => 5C/min => 250C (15min)40C (5min) => 2C/min => 200C => 5C/min => 250C (15min)
I 743.752.733.730.730.
ReferenceFuhrmann and Grosch, 2002Oruna-Concha, Bakker, et al., 2002Beaulieu and Grimm, 2001Boulanger and Crouzet, 2001Boulanger and Crouzet, 2001
Comment MSDC-RI MSDC-RI MSDC-RI MSDC-RI MSDC-RI
Column type CapillaryCapillaryCapillaryCapillaryCapillary
Active phase CP Sil 8 CBDB-5DB-5SE-54SE-52
Column length (m) 60.30.30.30.60.
Carrier gas  H2H2HeHe
Substrate
Column diameter (mm) 0.250.250.250.320.32
Phase thickness (μm) 0.250.250.250.250.40
Program 0C => rapidly => 40C(8min) => 4C/min => 250C(10min)40C(5min) => 2C/min => 220C => 5C/min => 250C(15min)40C(5min) => 2C/min => 220C => 5C/min => 250C(15min)35C (2min) => 40C/min => 50C (2min) => 6C/min => 180C => 10C/min => 230C (10min)45 C (6 min) 3 C/min -> 111 0C 2 C/min -> 160 C 3 C/min -> 300 C (15 min)
I 759.730.730.739.734.
ReferenceDuckham, Dodson, et al., 2001Boulanger, Chassagne, et al., 1999Boulanger, Chassagne, et al., 1999Buettner and Schieberle, 1999Mondello, Dugo, et al., 1995
Comment MSDC-RI MSDC-RI MSDC-RI MSDC-RI MSDC-RI

Van Den Dool and Kratz RI, polar column, custom temperature program

Data compiled by: NIST Mass Spectrometry Data Center, William E. Wallace, director

Column type CapillaryCapillaryCapillaryCapillaryCapillary
Active phase Supelcowax-10Supelcowax-10CP-Wax 52CBSOLGel-WaxFFAP
Column length (m) 30.30.60.30.30.
Carrier gas HeHeHeHeHe
Substrate
Column diameter (mm) 0.250.250.250.250.32
Phase thickness (μm) 0.250.250.250.250.25
Program 35C(8min) => 4C/min => 60C => 6C/min => 160C => 20C/min => 200C(1min)40C(1min) => 10C/min => 120C => 15C/min => 200C (1min)45C(5min) => 10C/min => 80C => 2C/min => 240C35C(5min) => 3C/min => 150C => 5C/min => 250C (10min)35C(2min) => 40C/min => 60C(2min) => 6C/min => 180C => 20C/min => 230C(10min)
I 1212.1207.1201.1182.1204.
ReferenceBianchi, Careri, et al., 2007Bianchi, Careri, et al., 2007Romeo, Ziino, et al., 2007Aubert, Baumann, et al., 2005Fritsch and Schieberle, 2005
Comment MSDC-RI MSDC-RI MSDC-RI MSDC-RI MSDC-RI
Column type CapillaryCapillaryCapillaryCapillaryCapillary
Active phase CP-Wax 52CBCarbowax 20MHP-InnowaxDB-WaxDB-Wax
Column length (m) 50.25.30.30.30.
Carrier gas HeH2HeH2H2
Substrate
Column diameter (mm) 0.250.320.320.250.25
Phase thickness (μm) 0.20.250.50.250.25
Program 33C(1.5min) => 1.5C/min => 60C(4min) => 2C/min => 100C => 8C/min => 220C(15min)40C (8min) => 3C/min => 180C => 20C/min => 230C40C(4min) => 10C/min => 70C => 5C/min => 150C => 10C/min => 250C (10min)60C (3min) => 2C/min => 220C => 5C/min => 250C (15min)60C (3min) => 2C/min => 220C => 5C/min => 250C (15min)
I 1191.1221.1217.1217.1216.
ReferenceKaack, Christensen, et al., 2005Boido, Lloret, et al., 2003Koprivnjak, Conte, et al., 2002Boulanger and Crouzet, 2001Boulanger and Crouzet, 2001
Comment MSDC-RI MSDC-RI MSDC-RI MSDC-RI MSDC-RI
Column type CapillaryCapillaryCapillary
Active phase FFAPFFAPCarbowax 20M
Column length (m) 30.50.150.
Carrier gas HeHe
Substrate
Column diameter (mm) 0.320.250.75
Phase thickness (μm) 0.250.25
Program 35C (2min) => 40C/min => 60C (2min) => 6C/min => 180C => 10C/min => 230C (10min)20C (5min) => 2C/min => 70C => 4C/min => 210Cnot specified
I 1211.1191.1210.
ReferenceBuettner and Schieberle, 1999Yasuhara, 1987Whitfield, Shea, et al., 1981
Comment MSDC-RI MSDC-RI MSDC-RI

Normal alkane RI, polar column, isothermal

Data compiled by: NIST Mass Spectrometry Data Center, William E. Wallace, director

Column type Packed
Active phase Carbowax 20M
Column length (m)
Carrier gas
Substrate
Column diameter (mm)
Phase thickness (μm)
Temperature (C) 100.
I 1187.
ReferenceYabumoto, Jennings, et al., 1977
Comment MSDC-RI

Normal alkane RI, polar column, custom temperature program

Data compiled by: NIST Mass Spectrometry Data Center, William E. Wallace, director

Column type CapillaryCapillaryCapillaryCapillaryCapillary
Active phase Carbowax 20MSupelco CO Wax-10Supelco CO Wax-10DB-WaxDB-Wax
Column length (m)  60.60.30.30.
Carrier gas  HeliumHeliumHeliumHelium
Substrate
Column diameter (mm)  0.320.320.250.25
Phase thickness (μm)  0.250.250.250.25
Program not specified35 0C (6 min) 2 0C/min -> 60 0C (5 min) 5 0C/min -> 200 0C 25 0C/min -> 250 0C (6 min)not specifiednot specifiednot specified
I 1213.1244.1218.1191.1196.
ReferenceLee, Chong, et al., 2012Prompona, Kandylis, et al., 2012Prompona, Kandylis, et al., 2012Welke, Manfroi, et al., 2012Welke, Manfroi, et al., 2012
Comment MSDC-RI MSDC-RI MSDC-RI MSDC-RI MSDC-RI
Column type CapillaryCapillaryCapillaryCapillaryCapillary
Active phase DB-WaxFFAPDB-WaxDB-WaxSupelcowax-10
Column length (m) 30.50.20.20.50.
Carrier gas HeliumHeliumHeliumHeliumHelium
Substrate
Column diameter (mm) 0.250.200.180.180.25
Phase thickness (μm) 0.250.330.180.180.25
Program not specified70 0C (1 min) 3 0C/min -> 142 0C 5 0C/min -> 225 0C (10 min)35 0C (1 min) 2.9 0C/min -> 100 0C 8 0C/min -> 200 0C (5 min)35 0C (1 min) 2/9 0C/min -> 100 0C 8 0C/min -> 200 0C (5 min)45 0C (15 min) 3 0C/min -> 75 0C 5 0C/min -> 180 0C (10 min)
I 1204.1199.1199.1200.1210.
ReferenceWelke, Manfroi, et al., 2012Ortiz, Echeverra, et al., 2009Rowan, Hunt, et al., 2009Rowan, Hunt, et al., 2009, 2Soria, Martinez-Castro, et al., 2009
Comment MSDC-RI MSDC-RI MSDC-RI MSDC-RI MSDC-RI
Column type CapillaryCapillaryCapillaryCapillaryCapillary
Active phase DB-WaxCP-Wax 52 CBSupelcowax 10Supelcowax 10DB-Wax
Column length (m) 30.50.50.50.30.
Carrier gas HeliumHeliumHeliumHeliumHelium
Substrate
Column diameter (mm) 0.320.250.250.250.32
Phase thickness (μm) 0.500.290.250.250.25
Program 40 0C 7 0C/min -> 110 0C 15 0C/min -> 250 0C (3 min)33 0C (1 min) 2 0C/min -> 130 0C 10 0C/min -> 220 0C45 0C (15 min) 3 0C/min -> 75 0C 5 0C/min -> 180 0C (10 min)45 0C (15 min) 3 0C/min -> 75 0C 5 0C/min -> 180 0C (10 min)50 0C 20 0C/min -> 80 0C 3 0C/min -> 230 0C
I 1214.1191.1210.1210.1224.
ReferenceValappil, Fan, et al., 2009Kaack and Christensen, 2008Soria, Martinez-Castro, et al., 2008Soria, Martinez-Castro, et al., 2008Tao, Wenlai, et al., 2008
Comment MSDC-RI MSDC-RI MSDC-RI MSDC-RI MSDC-RI
Column type CapillaryCapillaryCapillaryCapillaryCapillary
Active phase FFAPDB-FFAPFFAPFFAPDB-Wax
Column length (m) 50.30.50.50.60.
Carrier gas He HeHeHe
Substrate
Column diameter (mm) 0.20.320.20.20.25
Phase thickness (μm) 0.330.250.330.330.25
Program 70C(1min) => 3C/min => 142C => 5C/min => 225C (10min)35C(2min) => 40C/min => 50C(2min) => 6C/min => 180C => 10C/min => 230C(10min)70C(1min) => 3C/min => 142C => 5C/min => 225C(10min)70C(1min) => 3C/min => 142C => 5C/min => 225C(10min)35C(5min) => 2C/min => 50C => 5C/min => 200C (5min)
I 1210.1213.1210.1210.1210.
ReferenceLara, Echeverría, et al., 2007Lasekan, Buettner, et al., 2007Lopez, Villatoro, et al., 2007Lara, Graell, et al., 2006Mattheis, Fan, et al., 2005
Comment MSDC-RI MSDC-RI MSDC-RI MSDC-RI MSDC-RI
Column type CapillaryCapillaryCapillaryCapillaryCapillary
Active phase DB-FFAPFFAPDB-WaxCarbowax 20MCarbowax 20M
Column length (m) 30.50.60.
Carrier gas HeHeHelium
Substrate
Column diameter (mm) 0.320.20.25
Phase thickness (μm) 0.250.330.25
Program 40C(2min) => 40C/min => 60C(2min) => 6C/min => 180C => 15C/min => 230C (10min)70C(1min) => 3C/min => 142C => 5C/min => 225C(10min)60 0C (3 min) 2 0C/min -> 150 0C 4 0C/min -> 200 0Cnot specifiednot specified
I 1211.1210.1203.1221.1183.
ReferenceBuettner, 2004Echeverría, Correa, et al., 2004Kim. J.H., Ahn, et al., 2004Vinogradov, 2004Vinogradov, 2004
Comment MSDC-RI MSDC-RI MSDC-RI MSDC-RI MSDC-RI
Column type CapillaryCapillaryCapillaryCapillaryCapillary
Active phase HP-FFAPHP-InnowaxFFAPDB-WaxDB-Wax
Column length (m) 50.30.30.30.30.
Carrier gas HeHeHe
Substrate
Column diameter (mm) 0.20.320.320.250.25
Phase thickness (μm) 0.330.50.250.250.25
Program 70C(1min) => 3C/min => 142C => 5C/min => 225C (10min)50C(4min) => 10C/min => 230C(10min) => 10C/min => 250C35C (2min) => 40C/min => 60C (2min) => 6C/min => 180C => 10C/min => 230C (10min)50C(4min) => 4C/min => 130C => 1C/min => 190C => 4C/min => 220C(20min)50C(4min) => 4C/min => 130C => 1C/min => 190C => 4C/min => 220C(20min)
I 1210.1209.1211.1203.1209.
ReferenceEcheverria, Fuentes, et al., 2003Piasenzotto, Gracco, et al., 2003Buettner and Schieberle, 2001Mayorga, Knapp, et al., 2001Mayorga, Knapp, et al., 2001
Comment MSDC-RI MSDC-RI MSDC-RI MSDC-RI MSDC-RI
Column type CapillaryCapillaryCapillaryCapillaryCapillary
Active phase FFAPCross-linked FFAPCP-Wax 52CBFFAPPEG
Column length (m) 50.50.50.50.40.
Carrier gas N2N2HeN2Hydrogen
Substrate
Column diameter (mm) 0.20.20.250.20.182
Phase thickness (μm) 0.330.330.20.330.30
Program 70C(1min) => 3C/min => 142C(2min) => 25C/min => 230C(5min)70C(1min) => 3C/min => 142C (2min) => 25C/min => 230C(5min)30C (1.5min) => 3C/min => 120C => 10C/min => 220C (3.5min)70C (1min) => 3C/min => 142C (2min) => 25C/min => 230C (5min)35 0C (5 min) 5 0C/min -> 100 0C 3 0C/min -> 200 0C (1 min) 20 0C/min -> 240 0C (2 min)
I 1213.1213.1199.1213.1220.
ReferenceLopez, Lavilla, et al., 2000Lavilla, Puy, et al., 1999Jakobsen, Hansen, et al., 1998López, Lavilla, et al., 1998Vas, Gal, et al., 1998
Comment MSDC-RI MSDC-RI MSDC-RI MSDC-RI MSDC-RI
Column type CapillaryCapillaryCapillaryCapillaryCapillary
Active phase DB-WaxDB-WaxDB-WaxCarbowax 20MCarbowax 20M
Column length (m) 30.60.60.60.60.
Carrier gas    HeHe
Substrate
Column diameter (mm) 0.250.320.320.250.25
Phase thickness (μm) 0.25
Program not specifiednot specifiednot specifiednot specifiednot specified
I 1223.1203.1204.1184.1189.
ReferenceMarlatt, Ho, et al., 1992Binder, Flath, et al., 1989Binder and Flath, 1989Fagan, Kepner, et al., 1982Fagan, Kepner, et al., 1982
Comment MSDC-RI MSDC-RI MSDC-RI MSDC-RI MSDC-RI

Kovats' RI, non-polar column, isothermal

Data compiled by: NIST Mass Spectrometry Data Center, William E. Wallace, director

Column type PackedPackedPackedPackedPacked
Active phase Apiezon LApiezon LSE-30SE-30SE-30
Column length (m)   1.1.1.
Carrier gas   ArArAr
Substrate Celite 545Celite 545Chromosorb W AW DMCS HP (80-100 mesh)Chromosorb W AW DMCS HP (80-100 mesh)Chromosorb W AW DMCS HP (80-100 mesh)
Column diameter (mm)
Phase thickness (μm)
Temperature (C) 120.160.100.120.140.
I 701.711.727.726.724.
ReferenceBogoslovsky, Anvaer, et al., 1978Bogoslovsky, Anvaer, et al., 1978Pías and Gascó, 1975Pías and Gascó, 1975Pías and Gascó, 1975
Comment MSDC-RI MSDC-RI MSDC-RI MSDC-RI MSDC-RI
Column type PackedPacked
Active phase SqualaneSE-30
Column length (m)  2.
Carrier gas
Substrate Chromosorb GChromosorb W
Column diameter (mm)
Phase thickness (μm)
Temperature (C) 50.100.
I 700.724.
ReferenceMira and Sanchez, 1970Zarazir, Chovin, et al., 1970
Comment MSDC-RI MSDC-RI

References

Chao and Rossini, 1965
Chao, J.; Rossini, F.D.,
Heats of combustion, formation, and isomerization of nineteen alkanols,
J. Chem. Eng. Data, 1965, 10, 374-379. [all data]
Cox and Pilcher, 1970
Cox, J.D.; Pilcher, G.,
Thermochemistry of Organic and Organometallic Compounds, Academic Press, New York, 1970, 1-636. [all data]
Gude and Teja, 1995
Gude, M.; Teja, A.S.,
Vapor-Liquid Critical Properties of Elements and Compounds. 4. Aliphatic Alkanols,
J. Chem. Eng. Data, 1995, 40, 1025-1036. [all data]
Quadri, Khilar, et al., 1991
Quadri, S.K.; Khilar, K.C.; Kudchadker, A.P.; Patni, M.J.,
Measurement of the critical temperatures and critical pressures of some thermally stable or mildly unstable alkanols,
J. Chem. Thermodyn., 1991, 23, 67-76. [all data]
McCurdy and Laidler, 1963
McCurdy, K.G.; Laidler, K.J.,
HEATS OF VAPORIZATION OF A SERIES OF ALIPHATIC ALCOHOLS,
Can. J. Chem., 1963, 41, 8, 1867-1871, https://doi.org/10.1139/v63-274
. [all data]
Easton, Hargreaves, et al., 2007
Easton, B.C.; Hargreaves, M.K.; Mitchell, R.K.,
The isolation of (-)-sec.-butylcarbinol from fusel oil,
J. Appl. Chem., 2007, 7, 4, 198-204, https://doi.org/10.1002/jctb.5010070407
. [all data]
Boublik, Fried, et al., 1984
Boublik, T.; Fried, V.; Hala, E.,
The Vapour Pressures of Pure Substances: Selected Values of the Temperature Dependence of the Vapour Pressures of Some Pure Substances in the Normal and Low Pressure Region, 2nd ed., Elsevier, New York, 1984, 972. [all data]
Aucejo, Burguet, et al., 1994
Aucejo, Antonio; Burguet, M.C.; Monton, Juan B.; Munoz, Rosa; Sanchotello, Margarita; Vazquez, M. Isabel,
Isothermal Vapor-Liquid Equilibria of 1-Pentanol with 2-Methyl-1-butanol, 2-Methyl-2-butanol, and 3-Methyl-2-butanol,
J. Chem. Eng. Data, 1994, 39, 3, 578-580, https://doi.org/10.1021/je00015a040
. [all data]
Stephenson and Malanowski, 1987
Stephenson, Richard M.; Malanowski, Stanislaw,
Handbook of the Thermodynamics of Organic Compounds, 1987, https://doi.org/10.1007/978-94-009-3173-2
. [all data]
Thomas, Meatyard, et al., 1979
Thomas, Leo H.; Meatyard, Robert; Smith, Harry; Davies, Gwyn H.,
Vapor pressures and molar entropies of vaporization of monohydric alcohols,
J. Chem. Eng. Data, 1979, 24, 3, 159-161, https://doi.org/10.1021/je60082a032
. [all data]
Butler, Ramchandani, et al., 1935
Butler, J.A.V.; Ramchandani, C.N.; Thomson, D.W.,
58. The solubility of non-electrolytes. Part I. The free energy of hydration of some aliphatic alcohols,
J. Chem. Soc., 1935, 280, https://doi.org/10.1039/jr9350000280
. [all data]
Wilhoit and Zwolinski, 1973
Wilhoit, R.C.; Zwolinski, B.J.,
Physical and thermodynamic properties of aliphatic alcohols,
J. Phys. Chem. Ref. Data Suppl., 1973, 1, 2, 1. [all data]
Butler, Ramchandani, et al., 1935, 2
Butler, J.A.V.; Ramchandani, C.N.; Thomson, D.W.,
The Solubility of Non-Electrolytes. Part 1. The Free Energy of Hydration of Some Alphatic Alcohols,
J. Chem. Soc., 1935, 280-285, https://doi.org/10.1039/jr9350000280
. [all data]