2-Butanone, 4-(2,2-dimethyl-6-methylenecyclohexyl)-
- Formula: C13H22O
- Molecular weight: 194.3132
- IUPAC Standard InChIKey: ZLPHULOLXDKCND-UHFFFAOYSA-N
- CAS Registry Number: 13720-12-2
- Chemical structure:
View 3d structure (requires JavaScript / HTML 5) - Other names: 4-(2,2-Dimethyl-6-methylenecyclohexyl)-2-butanone; 4-(2,2-Dimethyl-6-methylenecyclohexyl)butan-2-one; dihydro- γ-ionone

Van Den Dool and Kratz RI, non-polar column, temperature ramp

Column type | Active phase | I | Reference | Comment |
---|---|---|---|---|
Capillary | VF-5MS | 1417. | Todua, 2011 | 30. m/0.25 mm/0.25 μm, He; Tstart: 60. C; Tend: 270. C |

Van Den Dool and Kratz RI, non-polar column, custom temperature program

Column type | Active phase | I | Reference | Comment |
---|---|---|---|---|
Capillary | HP-5MS | 1396.3 | Andriamaharavo, 2014 | 30. m/0.25 mm/0.25 μm, He; Program: 60C (1 min) => 5 C/min => 210C => 10 C/min => 280C (15 min) |

Normal alkane RI, polar column, temperature ramp

Column type | Active phase | I | Reference | Comment |
---|---|---|---|---|
Capillary | PEG-20M | 1798. | Awano, Ishizaki, et al., 2005 | N2, 3. K/min; Column length: 60. m; Column diameter: 0.25 mm; Tstart: 70. C; Tend: 220. C |

References

Todua, 2011
Todua, N.G.,
Retention Data. NIST Mass Spectrometry Data Center., NIST Mass Spectrometry Data Center, 2011. [all data]
Andriamaharavo, 2014
Andriamaharavo, N.R.,
Retention Data. NIST Mass Spectrometry Data Center., NIST Mass Spectrometry Data Center, 2014. [all data]
Awano, Ishizaki, et al., 2005
Awano, K.; Ishizaki, S.; Takazawa, O.; Kitahara, T.,
Analysis of ambergris tincture,
Flavour Fragr. J., 2005, 20, 1, 18-21, https://doi.org/10.1002/ffj.1413
. [all data]