Benzenamine, 2,4,5-trimethyl-
- Formula: C9H13N
- Molecular weight: 135.2062
- IUPAC Standard InChIKey: BMIPMKQAAJKBKP-UHFFFAOYSA-N
- CAS Registry Number: 137-17-7
- Chemical structure:
View 3d structure (requires JavaScript / HTML 5) - Other names: Aniline, 2,4,5-trimethyl-; ψ-Cumidine; Pseudocumidine; 2,4,5-Trimethylaniline; psi-Cumidine; NCI-C02299; 2,4,5-Trimethylanilin; 1-Amino-2,4,5-trimethylbenzene; Pseudokumidin; 1,2,4-Trimethyl-5-aminobenzene; 2,4,5-Trimethylbenzenamine; 2,4,5-Trimethylphenylamine; NSC 37004

Condensed phase thermochemistry data

Data compiled by: Hussein Y. Afeefy, Joel F. Liebman, and Stephen E. Stein
Quantity | Value | Units | Method | Reference | Comment |
---|---|---|---|---|---|
ΔfH°solid | -110. | kJ/mol | Ccb | Lemoult, 1907 | |
Quantity | Value | Units | Method | Reference | Comment |
ΔcH°solid | -5318.7 | kJ/mol | Ccb | Lemoult, 1907 |

Phase change data

Data compiled as indicated in comments:
BS - Robert L. Brown and Stephen E. Stein
Quantity | Value | Units | Method | Reference | Comment |
---|---|---|---|---|---|
Tboil | 507.7 | K | N/A | Weast and Grasselli, 1989 | BS |
Antoine Equation Parameters
log10(P) = A − (B / (T + C))
P = vapor pressure (bar)
T = temperature (K)
View plot Requires a JavaScript / HTML 5 canvas capable browser.
Temperature (K) | A | B | C | Reference | Comment |
---|---|---|---|---|---|
341.6 to 507.7 | 4.1924 | 1668.412 | -106.592 | Stull, 1947 | Coefficents calculated by NIST from author's data. |

Lee's RI, non-polar column, temperature ramp

Column type | Active phase | I | Reference | Comment |
---|---|---|---|---|
Capillary | DB-5 | 220.25 | Rostad and Pereira, 1986 | 30. m/0.26 mm/0.25 μm, He, 50. C @ 4. min, 6. K/min, 300. C @ 20. min |

References

Lemoult, 1907
Lemoult, M.P.,
Recherches theoriques et experimentales sur les chaleurs de combustion et de formation des composes organiques,
Ann. Chim. Phys., 1907, 12, 395-432. [all data]
Weast and Grasselli, 1989
CRC Handbook of Data on Organic Compounds, 2nd Editon, Weast,R.C and Grasselli, J.G., ed(s)., CRC Press, Inc., Boca Raton, FL, 1989, 1. [all data]
Stull, 1947
Stull, Daniel R.,
Vapor Pressure of Pure Substances. Organic and Inorganic Compounds,
Ind. Eng. Chem., 1947, 39, 4, 517-540, https://doi.org/10.1021/ie50448a022
. [all data]
Lang (editor), 1972
Lang (editor), L.,
Absorption Spectra in the Ultraviolet and Visible Region, 1972, 16, 211. [all data]
Rostad and Pereira, 1986
Rostad, C.E.; Pereira, W.E.,
Kovats and Lee retention indices determined by gas chromatography/mass spectrometry for organic compounds of environmental interest,
J. Hi. Res. Chromatogr. Chromatogr. Comm., 1986, 9, 6, 328-334, https://doi.org/10.1002/jhrc.1240090603
. [all data]